hama-dev mailing list archives

Site index · List index
Message view « Date » · « Thread »
Top « Date » · « Thread »
From Apache Jenkins Server <jenk...@builds.apache.org>
Subject Build failed in Jenkins: Hama-Nightly-for-Hadoop-2.x #531
Date Thu, 26 Feb 2015 23:44:40 GMT
See <https://builds.apache.org/job/Hama-Nightly-for-Hadoop-2.x/531/>

------------------------------------------
[...truncated 105283 lines...]
	at java.util.concurrent.FutureTask.run(FutureTask.java:166)
	at java.util.concurrent.ThreadPoolExecutor.runWorker(ThreadPoolExecutor.java:1145)
	at java.util.concurrent.ThreadPoolExecutor$Worker.run(ThreadPoolExecutor.java:615)
	... 1 more

15/02/26 23:44:09 INFO bsp.BSPJobClient: Current supersteps number: 42

15/02/26 23:44:09 INFO bsp.BSPJobClient: Job failed.

maxflow is: 23.0
Tests run: 1, Failures: 0, Errors: 0, Skipped: 0, Time elapsed: 0.007 sec
Running org.apache.hama.examples.BipartiteMatchingTest
15/02/26 23:44:10 WARN util.NativeCodeLoader: Unable to load native-hadoop library for your
platform... using builtin-java classes where applicable

15/02/26 23:44:10 INFO bsp.FileInputFormat: Total input paths to process : 1

15/02/26 23:44:10 WARN snappy.LoadSnappy: Snappy native library not loaded

15/02/26 23:44:10 INFO bsp.FileInputFormat: Total input paths to process : 1

15/02/26 23:44:10 WARN bsp.BSPJobClient: No job jar file set.  User classes may not be found.
See BSPJob#setJar(String) or check Your jar file.

15/02/26 23:44:10 INFO bsp.BSPJobClient: Running job: job_localrunner_0001

15/02/26 23:44:10 INFO bsp.LocalBSPRunner: Setting up a new barrier for 1 tasks!

15/02/26 23:44:13 INFO bsp.BSPJobClient: Current supersteps number: 1

15/02/26 23:44:13 INFO bsp.BSPJobClient: The total number of supersteps: 1

15/02/26 23:44:13 INFO bsp.BSPJobClient: Counters: 6

15/02/26 23:44:13 INFO bsp.BSPJobClient:   org.apache.hama.bsp.JobInProgress$JobCounter

15/02/26 23:44:13 INFO bsp.BSPJobClient:     SUPERSTEPS=1

15/02/26 23:44:13 INFO bsp.BSPJobClient:     LAUNCHED_TASKS=1

15/02/26 23:44:13 INFO bsp.BSPJobClient:   org.apache.hama.bsp.BSPPeerImpl$PeerCounter

15/02/26 23:44:13 INFO bsp.BSPJobClient:     SUPERSTEP_SUM=2

15/02/26 23:44:13 INFO bsp.BSPJobClient:     IO_BYTES_READ=26

15/02/26 23:44:13 INFO bsp.BSPJobClient:     TIME_IN_SYNC_MS=0

15/02/26 23:44:13 INFO bsp.BSPJobClient:     TASK_INPUT_RECORDS=4

15/02/26 23:44:13 INFO bsp.FileInputFormat: Total input paths to process : 2

15/02/26 23:44:13 WARN bsp.BSPJobClient: No job jar file set.  User classes may not be found.
See BSPJob#setJar(String) or check Your jar file.

15/02/26 23:44:13 INFO bsp.LocalBSPRunner: Setting up a new barrier for 2 tasks!

15/02/26 23:44:14 INFO bsp.BSPJobClient: Running job: job_localrunner_0001

15/02/26 23:44:14 INFO graph.GraphJobRunner: 2 vertices are loaded into local:1

15/02/26 23:44:14 INFO graph.GraphJobRunner: 2 vertices are loaded into local:0

15/02/26 23:44:17 INFO bsp.BSPJobClient: Current supersteps number: 7

15/02/26 23:44:17 INFO bsp.BSPJobClient: The total number of supersteps: 7

15/02/26 23:44:17 INFO bsp.BSPJobClient: Counters: 12

15/02/26 23:44:17 INFO bsp.BSPJobClient:   org.apache.hama.graph.GraphJobRunner$GraphJobCounter

15/02/26 23:44:17 INFO bsp.BSPJobClient:     ITERATIONS=6

15/02/26 23:44:17 INFO bsp.BSPJobClient:     INPUT_VERTICES=4

15/02/26 23:44:17 INFO bsp.BSPJobClient:   org.apache.hama.bsp.JobInProgress$JobCounter

15/02/26 23:44:17 INFO bsp.BSPJobClient:     SUPERSTEPS=7

15/02/26 23:44:17 INFO bsp.BSPJobClient:     LAUNCHED_TASKS=2

15/02/26 23:44:17 INFO bsp.BSPJobClient:   org.apache.hama.bsp.BSPPeerImpl$PeerCounter

15/02/26 23:44:17 INFO bsp.BSPJobClient:     SUPERSTEP_SUM=16

15/02/26 23:44:17 INFO bsp.BSPJobClient:     MESSAGE_BYTES_TRANSFERED=916

15/02/26 23:44:17 INFO bsp.BSPJobClient:     IO_BYTES_READ=90

15/02/26 23:44:17 INFO bsp.BSPJobClient:     TIME_IN_SYNC_MS=18

15/02/26 23:44:17 INFO bsp.BSPJobClient:     TOTAL_MESSAGES_SENT=38

15/02/26 23:44:17 INFO bsp.BSPJobClient:     TASK_INPUT_RECORDS=4

15/02/26 23:44:17 INFO bsp.BSPJobClient:     TOTAL_MESSAGES_RECEIVED=36

15/02/26 23:44:17 INFO bsp.BSPJobClient:     TASK_OUTPUT_RECORDS=4

Job Finished in 6.374 seconds
C -> D L expvalue = D L
A -> B L expvalue = B L
D -> C R expvalue = C R
B -> A R expvalue = A R
Tests run: 1, Failures: 0, Errors: 0, Skipped: 0, Time elapsed: 0.012 sec
Running org.apache.hama.examples.SemiClusterMatchingTest
15/02/26 23:44:17 WARN util.NativeCodeLoader: Unable to load native-hadoop library for your
platform... using builtin-java classes where applicable

15/02/26 23:44:17 INFO bsp.FileInputFormat: Total input paths to process : 1

15/02/26 23:44:17 WARN snappy.LoadSnappy: Snappy native library not loaded

15/02/26 23:44:17 INFO bsp.FileInputFormat: Total input paths to process : 1

15/02/26 23:44:17 WARN bsp.BSPJobClient: No job jar file set.  User classes may not be found.
See BSPJob#setJar(String) or check Your jar file.

15/02/26 23:44:18 INFO bsp.BSPJobClient: Running job: job_localrunner_0001

15/02/26 23:44:18 INFO bsp.LocalBSPRunner: Setting up a new barrier for 1 tasks!

15/02/26 23:44:21 INFO bsp.BSPJobClient: Current supersteps number: 1

15/02/26 23:44:21 INFO bsp.BSPJobClient: The total number of supersteps: 1

15/02/26 23:44:21 INFO bsp.BSPJobClient: Counters: 6

15/02/26 23:44:21 INFO bsp.BSPJobClient:   org.apache.hama.bsp.JobInProgress$JobCounter

15/02/26 23:44:21 INFO bsp.BSPJobClient:     SUPERSTEPS=1

15/02/26 23:44:21 INFO bsp.BSPJobClient:     LAUNCHED_TASKS=1

15/02/26 23:44:21 INFO bsp.BSPJobClient:   org.apache.hama.bsp.BSPPeerImpl$PeerCounter

15/02/26 23:44:21 INFO bsp.BSPJobClient:     SUPERSTEP_SUM=2

15/02/26 23:44:21 INFO bsp.BSPJobClient:     IO_BYTES_READ=7189

15/02/26 23:44:21 INFO bsp.BSPJobClient:     TIME_IN_SYNC_MS=0

15/02/26 23:44:21 INFO bsp.BSPJobClient:     TASK_INPUT_RECORDS=100

15/02/26 23:44:21 INFO bsp.FileInputFormat: Total input paths to process : 3

15/02/26 23:44:21 WARN bsp.BSPJobClient: No job jar file set.  User classes may not be found.
See BSPJob#setJar(String) or check Your jar file.

15/02/26 23:44:21 INFO bsp.LocalBSPRunner: Setting up a new barrier for 3 tasks!

15/02/26 23:44:21 INFO bsp.BSPJobClient: Running job: job_localrunner_0001

15/02/26 23:44:21 INFO graph.GraphJobRunner: 33 vertices are loaded into local:0

15/02/26 23:44:21 INFO graph.GraphJobRunner: 34 vertices are loaded into local:1

15/02/26 23:44:21 INFO graph.GraphJobRunner: 33 vertices are loaded into local:2

15/02/26 23:44:24 INFO bsp.BSPJobClient: Current supersteps number: 15

15/02/26 23:44:24 INFO bsp.BSPJobClient: The total number of supersteps: 15

15/02/26 23:44:24 INFO bsp.BSPJobClient: Counters: 12

15/02/26 23:44:24 INFO bsp.BSPJobClient:   org.apache.hama.graph.GraphJobRunner$GraphJobCounter

15/02/26 23:44:24 INFO bsp.BSPJobClient:     ITERATIONS=15

15/02/26 23:44:24 INFO bsp.BSPJobClient:     INPUT_VERTICES=100

15/02/26 23:44:24 INFO bsp.BSPJobClient:   org.apache.hama.bsp.JobInProgress$JobCounter

15/02/26 23:44:24 INFO bsp.BSPJobClient:     SUPERSTEPS=15

15/02/26 23:44:24 INFO bsp.BSPJobClient:     LAUNCHED_TASKS=3

15/02/26 23:44:24 INFO bsp.BSPJobClient:   org.apache.hama.bsp.BSPPeerImpl$PeerCounter

15/02/26 23:44:24 INFO bsp.BSPJobClient:     SUPERSTEP_SUM=48

15/02/26 23:44:24 INFO bsp.BSPJobClient:     MESSAGE_BYTES_TRANSFERED=24649761

15/02/26 23:44:24 INFO bsp.BSPJobClient:     IO_BYTES_READ=8850

15/02/26 23:44:24 INFO bsp.BSPJobClient:     TIME_IN_SYNC_MS=130

15/02/26 23:44:24 INFO bsp.BSPJobClient:     TOTAL_MESSAGES_SENT=166169

15/02/26 23:44:24 INFO bsp.BSPJobClient:     TASK_INPUT_RECORDS=100

15/02/26 23:44:24 INFO bsp.BSPJobClient:     TOTAL_MESSAGES_RECEIVED=4596

15/02/26 23:44:24 INFO bsp.BSPJobClient:     TASK_OUTPUT_RECORDS=100

Job Finished in 6.429 seconds
C1691 = [41, 44, 47, 42, 45, 48, 40, 43, 46, 49]
C1598 = [14, 17, 11, 18, 15, 12, 19, 16, 10, 13]
C1784 = [77, 74, 71, 78, 72, 75, 79, 76, 73, 70]
C1722 = [56, 59, 50, 53, 57, 54, 51, 55, 58, 52]
C1815 = [86, 83, 80, 89, 84, 81, 87, 85, 82, 88]
C79 = [5, 8, 2, 0, 6, 3, 9, 7, 1, 4]
C1753 = [62, 65, 68, 60, 63, 69, 66, 64, 61, 67]
C1629 = [26, 20, 23, 29, 27, 21, 24, 25, 28, 22]
C1846 = [98, 92, 95, 99, 90, 93, 96, 91, 94, 97]
C1660 = [38, 35, 32, 39, 36, 33, 30, 37, 34, 31]
Tests run: 1, Failures: 0, Errors: 0, Skipped: 0, Time elapsed: 0.011 sec

Results :

Failed tests: 

Tests run: 21, Failures: 1, Errors: 0, Skipped: 0

[INFO] ------------------------------------------------------------------------
[INFO] Reactor Summary:
[INFO] 
[INFO] Apache Hama parent POM ............................ SUCCESS [5.237s]
[INFO] pipes ............................................. SUCCESS [16.005s]
[INFO] commons ........................................... SUCCESS [8.293s]
[INFO] core .............................................. SUCCESS [3:05.497s]
[INFO] graph ............................................. SUCCESS [24.890s]
[INFO] machine learning .................................. SUCCESS [1:38.669s]
[INFO] examples .......................................... FAILURE [1:34.076s]
[INFO] mesos ............................................. SKIPPED
[INFO] hama-dist ......................................... SKIPPED
[INFO] ------------------------------------------------------------------------
[INFO] BUILD FAILURE
[INFO] ------------------------------------------------------------------------
[INFO] Total time: 7:13.332s
[INFO] Finished at: Thu Feb 26 23:44:24 UTC 2015
[INFO] Final Memory: 125M/423M
[INFO] ------------------------------------------------------------------------
[ERROR] Failed to execute goal org.apache.maven.plugins:maven-surefire-plugin:2.6:test (default-test)
on project hama-examples: There are test failures.
[ERROR] 
[ERROR] Please refer to /x1/jenkins/jenkins-slave/workspace/Hama-Nightly-for-Hadoop-2.x/trunk/examples/target/surefire-reports
for the individual test results.
[ERROR] -> [Help 1]
[ERROR] 
[ERROR] To see the full stack trace of the errors, re-run Maven with the -e switch.
[ERROR] Re-run Maven using the -X switch to enable full debug logging.
[ERROR] 
[ERROR] For more information about the errors and possible solutions, please read the following
articles:
[ERROR] [Help 1] http://cwiki.apache.org/confluence/display/MAVEN/MojoFailureException
[ERROR] 
[ERROR] After correcting the problems, you can resume the build with the command
[ERROR]   mvn <goals> -rf :hama-examples
Build step 'Invoke top-level Maven targets' marked build as failure
Archiving artifacts
Sending artifact delta relative to Hama-Nightly-for-Hadoop-2.x #530
Archived 145 artifacts
Archive block size is 32768
Received 0 blocks and 54916667 bytes
Compression is 0.0%
Took 15 sec
Recording test results

Mime
View raw message