hama-dev mailing list archives

Site index · List index
Message view « Date » · « Thread »
Top « Date » · « Thread »
From Apache Jenkins Server <jenk...@builds.apache.org>
Subject Build failed in Jenkins: Hama-Nightly-for-Hadoop-2.x #512
Date Sat, 07 Feb 2015 23:46:18 GMT
See <https://builds.apache.org/job/Hama-Nightly-for-Hadoop-2.x/512/>

------------------------------------------
[...truncated 131898 lines...]
[7.094064149371662, -4.309408625114272, 5.412141869325169, 4.778229824554746, 2.964266980841808,
-0.9456148394991056, -0.5756316615194502]	4.570228216084243
[7.086130978849286, -4.338807201271834, 5.402275517130851, 4.7644971285507856, 2.94260112270095,
-0.9712138933828114, -0.6091638550517424]	4.35070477467997
[7.078279787575417, -4.367467991903288, 5.392573118458076, 4.751092332714601, 2.9213451436250497,
-0.9963210944084716, -0.6421222134455117]	4.136204544458424
[7.070590165967807, -4.394674703108866, 5.383193849479623, 4.738333790121049, 2.900896989537819,
-1.0204589152235353, -0.6739496088942645]	3.9320992443258813
[7.063167338947803, -4.419480340330619, 5.374348153444877, 4.72664238634335, 2.881782773619096,
-1.0429960293855516, -0.7039094777967867]	3.746724152620719
[7.0560842347812, -4.441228589854085, 5.366181878052325, 4.716309814532597, 2.864367120496723,
-1.0634948990816013, -0.7314913386809223]	3.5882736744855825
[7.0560842347812, -4.441228589854085, 5.366181878052325, 4.716309814532597, 2.864367120496723,
-1.0634948990816013, -0.7314913386809223]	3.458803849984058

Job Finished in 3.487 seconds
Tests run: 1, Failures: 0, Errors: 0, Skipped: 0, Time elapsed: 0.012 sec
Running org.apache.hama.examples.MaxFlowTest
15/02/07 23:45:57 WARN util.NativeCodeLoader: Unable to load native-hadoop library for your
platform... using builtin-java classes where applicable

15/02/07 23:45:57 INFO compress.CodecPool: Got brand-new compressor

 0.0 1.0 16.0
 1.0 0.0 -16.0
 1.0 3.0 12.0
 3.0 1.0 -12.0
 3.0 5.0 20.0
 5.0 3.0 -20.0
 2.0 1.0 4.0
 1.0 2.0 -4.0
 3.0 2.0 9.0
 2.0 3.0 -9.0
 4.0 3.0 7.0
 3.0 4.0 -7.0
 0.0 2.0 13.0
 2.0 0.0 -13.0
 2.0 4.0 14.0
 4.0 2.0 -14.0
 4.0 5.0 4.0
 5.0 4.0 -4.0
15/02/07 23:45:57 INFO bsp.FileInputFormat: Total input paths to process : 1

15/02/07 23:45:57 INFO bsp.FileInputFormat: Total input paths to process : 1

15/02/07 23:45:57 WARN bsp.BSPJobClient: No job jar file set.  User classes may not be found.
See BSPJob#setJar(String) or check Your jar file.

15/02/07 23:45:57 INFO bsp.BSPJobClient: Running job: job_localrunner_0001

15/02/07 23:45:57 INFO compress.CodecPool: Got brand-new decompressor

15/02/07 23:45:57 INFO bsp.LocalBSPRunner: Setting up a new barrier for 1 tasks!

15/02/07 23:46:00 INFO bsp.BSPJobClient: Current supersteps number: 1

15/02/07 23:46:00 INFO bsp.BSPJobClient: The total number of supersteps: 1

15/02/07 23:46:00 INFO bsp.BSPJobClient: Counters: 6

15/02/07 23:46:00 INFO bsp.BSPJobClient:   org.apache.hama.bsp.JobInProgress$JobCounter

15/02/07 23:46:00 INFO bsp.BSPJobClient:     SUPERSTEPS=1

15/02/07 23:46:00 INFO bsp.BSPJobClient:     LAUNCHED_TASKS=1

15/02/07 23:46:00 INFO bsp.BSPJobClient:   org.apache.hama.bsp.BSPPeerImpl$PeerCounter

15/02/07 23:46:00 INFO bsp.BSPJobClient:     SUPERSTEP_SUM=2

15/02/07 23:46:00 INFO bsp.BSPJobClient:     IO_BYTES_READ=562

15/02/07 23:46:00 INFO bsp.BSPJobClient:     TIME_IN_SYNC_MS=0

15/02/07 23:46:00 INFO bsp.BSPJobClient:     TASK_INPUT_RECORDS=18

15/02/07 23:46:00 INFO bsp.FileInputFormat: Total input paths to process : 3

15/02/07 23:46:00 WARN bsp.BSPJobClient: No job jar file set.  User classes may not be found.
See BSPJob#setJar(String) or check Your jar file.

15/02/07 23:46:00 INFO bsp.LocalBSPRunner: Setting up a new barrier for 3 tasks!

15/02/07 23:46:00 INFO bsp.BSPJobClient: Running job: job_localrunner_0001

15/02/07 23:46:00 INFO graph.GraphJobRunner: 2 vertices are loaded into local:0

15/02/07 23:46:00 INFO graph.GraphJobRunner: 2 vertices are loaded into local:1

15/02/07 23:46:00 INFO graph.GraphJobRunner: 2 vertices are loaded into local:2

maxFlow is: 19.0
15/02/07 23:46:01 ERROR bsp.LocalBSPRunner: Exception during BSP execution!
java.util.concurrent.ExecutionException: java.lang.AssertionError: vertex value cannot be
null
	at java.util.concurrent.FutureTask$Sync.innerGet(FutureTask.java:252)
	at java.util.concurrent.FutureTask.get(FutureTask.java:111)
	at org.apache.hama.bsp.LocalBSPRunner$ThreadObserver.run(LocalBSPRunner.java:315)
	at java.lang.Thread.run(Thread.java:724)
Caused by: java.lang.AssertionError: vertex value cannot be null
	at org.apache.hama.graph.DefaultVertexOutputWriter.write(DefaultVertexOutputWriter.java:49)
	at org.apache.hama.graph.GraphJobRunner.cleanup(GraphJobRunner.java:172)
	at org.apache.hama.bsp.LocalBSPRunner$BSPRunner.run(LocalBSPRunner.java:264)
	at org.apache.hama.bsp.LocalBSPRunner$BSPRunner.call(LocalBSPRunner.java:288)
	at org.apache.hama.bsp.LocalBSPRunner$BSPRunner.call(LocalBSPRunner.java:212)
	at java.util.concurrent.FutureTask$Sync.innerRun(FutureTask.java:334)
	at java.util.concurrent.FutureTask.run(FutureTask.java:166)
	at java.util.concurrent.Executors$RunnableAdapter.call(Executors.java:471)
	at java.util.concurrent.FutureTask$Sync.innerRun(FutureTask.java:334)
	at java.util.concurrent.FutureTask.run(FutureTask.java:166)
	at java.util.concurrent.ThreadPoolExecutor.runWorker(ThreadPoolExecutor.java:1145)
	at java.util.concurrent.ThreadPoolExecutor$Worker.run(ThreadPoolExecutor.java:615)
	... 1 more

15/02/07 23:46:03 INFO bsp.BSPJobClient: Current supersteps number: 50

15/02/07 23:46:03 INFO bsp.BSPJobClient: Job failed.

maxflow is: 23.0
Tests run: 1, Failures: 1, Errors: 0, Skipped: 0, Time elapsed: 0.018 sec <<< FAILURE!
Running org.apache.hama.examples.SemiClusterMatchingTest
15/02/07 23:46:05 WARN util.NativeCodeLoader: Unable to load native-hadoop library for your
platform... using builtin-java classes where applicable

15/02/07 23:46:05 INFO bsp.FileInputFormat: Total input paths to process : 1

15/02/07 23:46:05 WARN snappy.LoadSnappy: Snappy native library not loaded

15/02/07 23:46:05 INFO bsp.FileInputFormat: Total input paths to process : 1

15/02/07 23:46:05 WARN bsp.BSPJobClient: No job jar file set.  User classes may not be found.
See BSPJob#setJar(String) or check Your jar file.

15/02/07 23:46:05 INFO bsp.BSPJobClient: Running job: job_localrunner_0001

15/02/07 23:46:05 INFO bsp.LocalBSPRunner: Setting up a new barrier for 1 tasks!

15/02/07 23:46:08 INFO bsp.BSPJobClient: Current supersteps number: 1

15/02/07 23:46:08 INFO bsp.BSPJobClient: The total number of supersteps: 1

15/02/07 23:46:08 INFO bsp.BSPJobClient: Counters: 6

15/02/07 23:46:08 INFO bsp.BSPJobClient:   org.apache.hama.bsp.JobInProgress$JobCounter

15/02/07 23:46:08 INFO bsp.BSPJobClient:     SUPERSTEPS=1

15/02/07 23:46:08 INFO bsp.BSPJobClient:     LAUNCHED_TASKS=1

15/02/07 23:46:08 INFO bsp.BSPJobClient:   org.apache.hama.bsp.BSPPeerImpl$PeerCounter

15/02/07 23:46:08 INFO bsp.BSPJobClient:     SUPERSTEP_SUM=2

15/02/07 23:46:08 INFO bsp.BSPJobClient:     IO_BYTES_READ=7189

15/02/07 23:46:08 INFO bsp.BSPJobClient:     TIME_IN_SYNC_MS=1

15/02/07 23:46:08 INFO bsp.BSPJobClient:     TASK_INPUT_RECORDS=100

15/02/07 23:46:08 INFO bsp.FileInputFormat: Total input paths to process : 3

15/02/07 23:46:08 WARN bsp.BSPJobClient: No job jar file set.  User classes may not be found.
See BSPJob#setJar(String) or check Your jar file.

15/02/07 23:46:08 INFO bsp.LocalBSPRunner: Setting up a new barrier for 3 tasks!

15/02/07 23:46:08 INFO bsp.BSPJobClient: Running job: job_localrunner_0001

15/02/07 23:46:08 INFO graph.GraphJobRunner: 33 vertices are loaded into local:0

15/02/07 23:46:08 INFO graph.GraphJobRunner: 34 vertices are loaded into local:1

15/02/07 23:46:08 INFO graph.GraphJobRunner: 33 vertices are loaded into local:2

15/02/07 23:46:11 INFO bsp.BSPJobClient: Current supersteps number: 15

15/02/07 23:46:11 INFO bsp.BSPJobClient: The total number of supersteps: 15

15/02/07 23:46:11 INFO bsp.BSPJobClient: Counters: 12

15/02/07 23:46:11 INFO bsp.BSPJobClient:   org.apache.hama.graph.GraphJobRunner$GraphJobCounter

15/02/07 23:46:11 INFO bsp.BSPJobClient:     ITERATIONS=15

15/02/07 23:46:11 INFO bsp.BSPJobClient:     INPUT_VERTICES=100

15/02/07 23:46:11 INFO bsp.BSPJobClient:   org.apache.hama.bsp.JobInProgress$JobCounter

15/02/07 23:46:11 INFO bsp.BSPJobClient:     SUPERSTEPS=15

15/02/07 23:46:11 INFO bsp.BSPJobClient:     LAUNCHED_TASKS=3

15/02/07 23:46:11 INFO bsp.BSPJobClient:   org.apache.hama.bsp.BSPPeerImpl$PeerCounter

15/02/07 23:46:11 INFO bsp.BSPJobClient:     SUPERSTEP_SUM=48

15/02/07 23:46:11 INFO bsp.BSPJobClient:     MESSAGE_BYTES_TRANSFERED=24648001

15/02/07 23:46:11 INFO bsp.BSPJobClient:     IO_BYTES_READ=8850

15/02/07 23:46:11 INFO bsp.BSPJobClient:     TIME_IN_SYNC_MS=327

15/02/07 23:46:11 INFO bsp.BSPJobClient:     TOTAL_MESSAGES_SENT=166158

15/02/07 23:46:11 INFO bsp.BSPJobClient:     TASK_INPUT_RECORDS=100

15/02/07 23:46:11 INFO bsp.BSPJobClient:     TOTAL_MESSAGES_RECEIVED=4596

15/02/07 23:46:11 INFO bsp.BSPJobClient:     TASK_OUTPUT_RECORDS=100

Job Finished in 6.534 seconds
C1691 = [41, 44, 47, 42, 45, 48, 40, 43, 46, 49]
C1598 = [14, 17, 18, 15, 12, 19, 16, 10, 13]
Tests run: 1, Failures: 1, Errors: 0, Skipped: 0, Time elapsed: 0.018 sec <<< FAILURE!

Results :

Failed tests: 
  testSemiClustering(org.apache.hama.examples.SemiClusterMatchingTest)

Tests run: 21, Failures: 2, Errors: 0, Skipped: 0

[INFO] ------------------------------------------------------------------------
[INFO] Reactor Summary:
[INFO] 
[INFO] Apache Hama parent POM ............................ SUCCESS [44.248s]
[INFO] pipes ............................................. SUCCESS [24.374s]
[INFO] commons ........................................... SUCCESS [10.997s]
[INFO] core .............................................. SUCCESS [3:26.631s]
[INFO] graph ............................................. SUCCESS [30.187s]
[INFO] machine learning .................................. SUCCESS [1:54.431s]
[INFO] examples .......................................... FAILURE [1:44.696s]
[INFO] mesos ............................................. SKIPPED
[INFO] hama-dist ......................................... SKIPPED
[INFO] ------------------------------------------------------------------------
[INFO] BUILD FAILURE
[INFO] ------------------------------------------------------------------------
[INFO] Total time: 8:58.596s
[INFO] Finished at: Sat Feb 07 23:46:11 UTC 2015
[INFO] Final Memory: 125M/301M
[INFO] ------------------------------------------------------------------------
[ERROR] Failed to execute goal org.apache.maven.plugins:maven-surefire-plugin:2.6:test (default-test)
on project hama-examples: There are test failures.
[ERROR] 
[ERROR] Please refer to <https://builds.apache.org/job/Hama-Nightly-for-Hadoop-2.x/ws/trunk/examples/target/surefire-reports>
for the individual test results.
[ERROR] -> [Help 1]
[ERROR] 
[ERROR] To see the full stack trace of the errors, re-run Maven with the -e switch.
[ERROR] Re-run Maven using the -X switch to enable full debug logging.
[ERROR] 
[ERROR] For more information about the errors and possible solutions, please read the following
articles:
[ERROR] [Help 1] http://cwiki.apache.org/confluence/display/MAVEN/MojoFailureException
[ERROR] 
[ERROR] After correcting the problems, you can resume the build with the command
[ERROR]   mvn <goals> -rf :hama-examples
Build step 'Invoke top-level Maven targets' marked build as failure
Archiving artifacts
Sending artifact delta relative to Hama-Nightly-for-Hadoop-2.x #511
Archived 148 artifacts
Archive block size is 32768
Received 0 blocks and 426867 bytes
Compression is 0.0%
Took 2.8 sec
Recording test results

Mime
View raw message