hama-dev mailing list archives

Site index · List index
Message view « Date » · « Thread »
Top « Date » · « Thread »
From Apache Jenkins Server <jenk...@builds.apache.org>
Subject Build failed in Jenkins: Hama-Nightly-for-Hadoop-1.x #1524
Date Tue, 17 Feb 2015 00:00:33 GMT
See <https://builds.apache.org/job/Hama-Nightly-for-Hadoop-1.x/1524/>

------------------------------------------
[...truncated 5155 lines...]

15/02/17 00:00:10 INFO ipc.Server: IPC Server handler 2 on 61001: exiting

15/02/17 00:00:10 INFO zookeeper.ClientCnxn: EventThread shut down

15/02/17 00:00:10 INFO ipc.Server: IPC Server handler 1 on 61001: exiting

15/02/17 00:00:10 INFO bsp.GroomServer: Task attempt_201502162359_0003_000001_0 is done.

15/02/17 00:00:11 INFO bsp.JobInProgress: Job successfully done.

15/02/17 00:00:12 INFO bsp.BSPJobClient: Job complete: job_201502162359_0003

15/02/17 00:00:12 INFO bsp.BSPJobClient: The total number of supersteps: 1

15/02/17 00:00:12 INFO bsp.BSPJobClient: Counters: 8

15/02/17 00:00:12 INFO bsp.BSPJobClient:   org.apache.hama.bsp.JobInProgress$JobCounter

15/02/17 00:00:12 INFO bsp.BSPJobClient:     LAUNCHED_TASKS=2

15/02/17 00:00:12 INFO bsp.BSPJobClient:   org.apache.hama.bsp.BSPPeerImpl$PeerCounter

15/02/17 00:00:12 INFO bsp.BSPJobClient:     SUPERSTEP_SUM=2

15/02/17 00:00:12 INFO bsp.BSPJobClient:     MESSAGE_BYTES_TRANSFERED=15229

15/02/17 00:00:12 INFO bsp.BSPJobClient:     TIME_IN_SYNC_MS=52

15/02/17 00:00:12 INFO bsp.BSPJobClient:     IO_BYTES_READ=7289

15/02/17 00:00:12 INFO bsp.BSPJobClient:     TOTAL_MESSAGES_SENT=29

15/02/17 00:00:12 INFO bsp.BSPJobClient:     TASK_INPUT_RECORDS=29

15/02/17 00:00:12 INFO bsp.BSPJobClient:     TOTAL_MESSAGES_RECEIVED=29

15/02/17 00:00:12 INFO pipes.TestPipes: Client finishes execution job

15/02/17 00:00:12 INFO server.PrepRequestProcessor: Processed session termination for sessionid:
0x14b94d586e40000

15/02/17 00:00:12 INFO zookeeper.ZooKeeper: Session: 0x14b94d586e40000 closed

15/02/17 00:00:12 INFO server.NIOServerCnxn: Closed socket connection for client /0:0:0:0:0:0:0:1:59897
which had sessionid 0x14b94d586e40000

15/02/17 00:00:12 INFO zookeeper.ClientCnxn: EventThread shut down

15/02/17 00:00:12 INFO ipc.Server: Stopping server on 40000

15/02/17 00:00:12 INFO ipc.Server: Stopping IPC Server listener on 40000

15/02/17 00:00:12 INFO ipc.Server: IPC Server handler 0 on 40000: exiting

15/02/17 00:00:12 INFO bsp.BSPMaster: Stopped RPC Master server.

15/02/17 00:00:12 INFO ipc.Server: Stopping IPC Server Responder

15/02/17 00:00:12 INFO server.PrepRequestProcessor: Processed session termination for sessionid:
0x14b94d586e40001

15/02/17 00:00:12 INFO server.NIOServerCnxn: Closed socket connection for client /0:0:0:0:0:0:0:1:59898
which had sessionid 0x14b94d586e40001

15/02/17 00:00:12 INFO zookeeper.ZooKeeper: Session: 0x14b94d586e40001 closed

15/02/17 00:00:12 INFO zookeeper.ClientCnxn: EventThread shut down

15/02/17 00:00:12 INFO ipc.Server: Stopping server on 33120

15/02/17 00:00:12 INFO ipc.Server: IPC Server handler 0 on 33120: exiting

15/02/17 00:00:12 INFO ipc.Server: Stopping IPC Server listener on 33120

15/02/17 00:00:12 INFO ipc.Server: Stopping server on 52923

15/02/17 00:00:12 INFO ipc.Server: Stopping IPC Server Responder

15/02/17 00:00:12 INFO ipc.Server: IPC Server handler 0 on 52923: exiting

15/02/17 00:00:12 INFO ipc.Server: IPC Server handler 1 on 52923: exiting

15/02/17 00:00:12 INFO ipc.Server: IPC Server handler 4 on 52923: exiting

15/02/17 00:00:12 INFO ipc.Server: IPC Server handler 3 on 52923: exiting

15/02/17 00:00:12 INFO ipc.Server: IPC Server handler 2 on 52923: exiting

15/02/17 00:00:12 INFO ipc.Server: Stopping IPC Server listener on 52923

15/02/17 00:00:12 INFO ipc.Server: Stopping IPC Server Responder

15/02/17 00:00:12 INFO server.NIOServerCnxnFactory: NIOServerCnxn factory exited run method

15/02/17 00:00:12 INFO server.ZooKeeperServer: shutting down

15/02/17 00:00:12 INFO server.SessionTrackerImpl: Shutting down

15/02/17 00:00:12 INFO server.PrepRequestProcessor: Shutting down

15/02/17 00:00:12 INFO server.SyncRequestProcessor: Shutting down

15/02/17 00:00:12 INFO server.PrepRequestProcessor: PrepRequestProcessor exited loop!

15/02/17 00:00:12 INFO server.SyncRequestProcessor: SyncRequestProcessor exited!

15/02/17 00:00:12 INFO server.FinalRequestProcessor: shutdown of request processor complete

Tests run: 1, Failures: 0, Errors: 0, Skipped: 0, Time elapsed: 0.016 sec
Running org.apache.hama.bsp.TestLocalRunner
15/02/17 00:00:13 WARN util.NativeCodeLoader: Unable to load native-hadoop library for your
platform... using builtin-java classes where applicable

15/02/17 00:00:13 WARN bsp.BSPJobClient: No job jar file set.  User classes may not be found.
See BSPJob#setJar(String) or check Your jar file.

15/02/17 00:00:13 INFO bsp.BSPJobClient: Running job: job_localrunner_0001

15/02/17 00:00:13 INFO bsp.LocalBSPRunner: Setting up a new barrier for 3 tasks!

15/02/17 00:00:16 INFO bsp.BSPJobClient: Current supersteps number: 14

15/02/17 00:00:16 INFO bsp.BSPJobClient: The total number of supersteps: 14

15/02/17 00:00:16 INFO bsp.BSPJobClient: Counters: 8

15/02/17 00:00:16 INFO bsp.BSPJobClient:   org.apache.hama.bsp.JobInProgress$JobCounter

15/02/17 00:00:16 INFO bsp.BSPJobClient:     SUPERSTEPS=14

15/02/17 00:00:16 INFO bsp.BSPJobClient:     LAUNCHED_TASKS=3

15/02/17 00:00:16 INFO bsp.BSPJobClient:   org.apache.hama.bsp.BSPPeerImpl$PeerCounter

15/02/17 00:00:16 INFO bsp.BSPJobClient:     SUPERSTEP_SUM=45

15/02/17 00:00:16 INFO bsp.BSPJobClient:     MESSAGE_BYTES_TRANSFERED=2565

15/02/17 00:00:16 INFO bsp.BSPJobClient:     TIME_IN_SYNC_MS=23

15/02/17 00:00:16 INFO bsp.BSPJobClient:     TOTAL_MESSAGES_SENT=135

15/02/17 00:00:16 INFO bsp.BSPJobClient:     TOTAL_MESSAGES_RECEIVED=135

15/02/17 00:00:16 INFO bsp.BSPJobClient:     TASK_OUTPUT_RECORDS=135

Tests run: 1, Failures: 0, Errors: 0, Skipped: 0, Time elapsed: 0.008 sec
Running org.apache.hama.zookeeper.TestZKTools
Tests run: 1, Failures: 0, Errors: 0, Skipped: 0, Time elapsed: 0.009 sec
Running org.apache.hama.bsp.TestZooKeeper
15/02/17 00:00:18 ERROR quorum.QuorumPeerConfig: Invalid configuration, only one server specified
(ignoring)

15/02/17 00:00:18 INFO server.ZooKeeperServerMain: Starting server

15/02/17 00:00:18 INFO server.ZooKeeperServer: Server environment:zookeeper.version=3.4.5-1392090,
built on 09/30/2012 17:52 GMT

15/02/17 00:00:18 INFO server.ZooKeeperServer: Server environment:host.name=asf910.gq1.ygridcore.net

15/02/17 00:00:18 INFO server.ZooKeeperServer: Server environment:java.version=1.7.0_25

15/02/17 00:00:18 INFO server.ZooKeeperServer: Server environment:java.vendor=Oracle Corporation

15/02/17 00:00:18 INFO server.ZooKeeperServer: Server environment:java.home=/home/jenkins/tools/java/jdk1.7.0_25-32/jre

15/02/17 00:00:18 INFO server.ZooKeeperServer: Server environment:java.class.path=/tmp/surefirebooter2275713379141486702.jar

15/02/17 00:00:18 INFO server.ZooKeeperServer: Server environment:java.library.path=/usr/java/packages/lib/i386:/lib:/usr/lib

15/02/17 00:00:18 INFO server.ZooKeeperServer: Server environment:java.io.tmpdir=/tmp

15/02/17 00:00:18 INFO server.ZooKeeperServer: Server environment:java.compiler=<NA>

15/02/17 00:00:18 INFO server.ZooKeeperServer: Server environment:os.name=Linux

15/02/17 00:00:18 INFO server.ZooKeeperServer: Server environment:os.arch=i386

15/02/17 00:00:18 INFO server.ZooKeeperServer: Server environment:os.version=3.13.0-36-lowlatency

15/02/17 00:00:18 INFO server.ZooKeeperServer: Server environment:user.name=jenkins

15/02/17 00:00:18 INFO server.ZooKeeperServer: Server environment:user.home=/home/jenkins

15/02/17 00:00:18 INFO server.ZooKeeperServer: Server environment:user.dir=/tmp

15/02/17 00:00:18 INFO server.ZooKeeperServer: tickTime set to 3000

15/02/17 00:00:18 INFO server.ZooKeeperServer: minSessionTimeout set to -1

15/02/17 00:00:18 INFO server.ZooKeeperServer: maxSessionTimeout set to 1200000

15/02/17 00:00:18 INFO server.NIOServerCnxnFactory: binding to port 0.0.0.0/0.0.0.0:20000

15/02/17 00:00:18 INFO persistence.FileSnap: Reading snapshot /tmp/hama-testzookeeper/version-2/snapshot.262

15/02/17 00:00:18 INFO persistence.FileTxnSnapLog: Snapshotting: 0x267 to /tmp/hama-testzookeeper/version-2/snapshot.267

15/02/17 00:00:28 INFO zookeeper.ZooKeeper: Client environment:zookeeper.version=3.4.5-1392090,
built on 09/30/2012 17:52 GMT

15/02/17 00:00:28 INFO zookeeper.ZooKeeper: Client environment:host.name=asf910.gq1.ygridcore.net

15/02/17 00:00:28 INFO zookeeper.ZooKeeper: Client environment:java.version=1.7.0_25

15/02/17 00:00:28 INFO zookeeper.ZooKeeper: Client environment:java.vendor=Oracle Corporation

15/02/17 00:00:28 INFO zookeeper.ZooKeeper: Client environment:java.home=/home/jenkins/tools/java/jdk1.7.0_25-32/jre


Results :

Failed tests: 

Tests run: 65, Failures: 1, Errors: 0, Skipped: 0

[INFO] ------------------------------------------------------------------------
[INFO] Reactor Summary:
[INFO] 
[INFO] Apache Hama parent POM ............................ SUCCESS [4.097s]
[INFO] pipes ............................................. SUCCESS [18.711s]
[INFO] commons ........................................... SUCCESS [6.782s]
[INFO] core .............................................. FAILURE [2:48.500s]
[INFO] graph ............................................. SKIPPED
[INFO] machine learning .................................. SKIPPED
[INFO] examples .......................................... SKIPPED
[INFO] mesos ............................................. SKIPPED
[INFO] hama-dist ......................................... SKIPPED
[INFO] ------------------------------------------------------------------------
[INFO] BUILD FAILURE
[INFO] ------------------------------------------------------------------------
[INFO] Total time: 3:18.723s
[INFO] Finished at: Tue Feb 17 00:00:28 UTC 2015
[INFO] Final Memory: 57M/631M
[INFO] ------------------------------------------------------------------------
[ERROR] Failed to execute goal org.apache.maven.plugins:maven-surefire-plugin:2.6:test (default-test)
on project hama-core: There are test failures.
[ERROR] 
[ERROR] Please refer to <https://builds.apache.org/job/Hama-Nightly-for-Hadoop-1.x/ws/trunk/core/target/surefire-reports>
for the individual test results.
[ERROR] -> [Help 1]
[ERROR] 
[ERROR] To see the full stack trace of the errors, re-run Maven with the -e switch.
[ERROR] Re-run Maven using the -X switch to enable full debug logging.
[ERROR] 
[ERROR] For more information about the errors and possible solutions, please read the following
articles:
[ERROR] [Help 1] http://cwiki.apache.org/confluence/display/MAVEN/MojoFailureException
[ERROR] 
[ERROR] After correcting the problems, you can resume the build with the command
[ERROR]   mvn <goals> -rf :hama-core
Build step 'Invoke top-level Maven targets' marked build as failure
Archiving artifacts
Sending artifact delta relative to Hama-Nightly-for-Hadoop-1.x #1522
Archived 75 artifacts
Archive block size is 32768
Received 0 blocks and 245980 bytes
Compression is 0.0%
Took 2.6 sec
Recording test results

Mime
View raw message