hama-dev mailing list archives

Site index · List index
Message view « Date » · « Thread »
Top « Date » · « Thread »
From Apache Jenkins Server <jenk...@builds.apache.org>
Subject Build failed in Jenkins: Hama-Nightly-for-Hadoop-1.x #1528
Date Sat, 21 Feb 2015 00:00:31 GMT
See <https://builds.apache.org/job/Hama-Nightly-for-Hadoop-1.x/1528/>

------------------------------------------
[...truncated 5302 lines...]
Tests run: 1, Failures: 0, Errors: 0, Skipped: 0, Time elapsed: 0.01 sec
Running org.apache.hama.bsp.TestZooKeeper
15/02/21 00:00:16 ERROR quorum.QuorumPeerConfig: Invalid configuration, only one server specified
(ignoring)

15/02/21 00:00:16 INFO server.ZooKeeperServerMain: Starting server

15/02/21 00:00:16 INFO server.ZooKeeperServer: Server environment:zookeeper.version=3.4.5-1392090,
built on 09/30/2012 17:52 GMT

15/02/21 00:00:16 INFO server.ZooKeeperServer: Server environment:host.name=asf910.gq1.ygridcore.net

15/02/21 00:00:16 INFO server.ZooKeeperServer: Server environment:java.version=1.7.0_25

15/02/21 00:00:16 INFO server.ZooKeeperServer: Server environment:java.vendor=Oracle Corporation

15/02/21 00:00:16 INFO server.ZooKeeperServer: Server environment:java.home=/home/jenkins/tools/java/jdk1.7.0_25-32/jre

15/02/21 00:00:16 INFO server.ZooKeeperServer: Server environment:java.class.path=/tmp/surefirebooter8776207397967061844.jar

15/02/21 00:00:16 INFO server.ZooKeeperServer: Server environment:java.library.path=/usr/java/packages/lib/i386:/lib:/usr/lib

15/02/21 00:00:16 INFO server.ZooKeeperServer: Server environment:java.io.tmpdir=/tmp

15/02/21 00:00:16 INFO server.ZooKeeperServer: Server environment:java.compiler=<NA>

15/02/21 00:00:16 INFO server.ZooKeeperServer: Server environment:os.name=Linux

15/02/21 00:00:16 INFO server.ZooKeeperServer: Server environment:os.arch=i386

15/02/21 00:00:16 INFO server.ZooKeeperServer: Server environment:os.version=3.13.0-36-lowlatency

15/02/21 00:00:16 INFO server.ZooKeeperServer: Server environment:user.name=jenkins

15/02/21 00:00:16 INFO server.ZooKeeperServer: Server environment:user.home=/home/jenkins

15/02/21 00:00:16 INFO server.ZooKeeperServer: Server environment:user.dir=/tmp

15/02/21 00:00:16 INFO server.ZooKeeperServer: tickTime set to 3000

15/02/21 00:00:16 INFO server.ZooKeeperServer: minSessionTimeout set to -1

15/02/21 00:00:16 INFO server.ZooKeeperServer: maxSessionTimeout set to 1200000

15/02/21 00:00:16 INFO server.NIOServerCnxnFactory: binding to port 0.0.0.0/0.0.0.0:20000

15/02/21 00:00:16 INFO persistence.FileSnap: Reading snapshot /tmp/hama-testzookeeper/version-2/snapshot.2c8

15/02/21 00:00:16 INFO persistence.FileTxnSnapLog: Snapshotting: 0x2cd to /tmp/hama-testzookeeper/version-2/snapshot.2cd

15/02/21 00:00:26 INFO zookeeper.ZooKeeper: Client environment:zookeeper.version=3.4.5-1392090,
built on 09/30/2012 17:52 GMT

15/02/21 00:00:26 INFO zookeeper.ZooKeeper: Client environment:host.name=asf910.gq1.ygridcore.net

15/02/21 00:00:26 INFO zookeeper.ZooKeeper: Client environment:java.version=1.7.0_25

15/02/21 00:00:26 INFO zookeeper.ZooKeeper: Client environment:java.vendor=Oracle Corporation

15/02/21 00:00:26 INFO zookeeper.ZooKeeper: Client environment:java.home=/home/jenkins/tools/java/jdk1.7.0_25-32/jre

15/02/21 00:00:26 INFO zookeeper.ZooKeeper: Client environment:java.class.path=/tmp/surefirebooter8776207397967061844.jar

15/02/21 00:00:26 INFO zookeeper.ZooKeeper: Client environment:java.library.path=/usr/java/packages/lib/i386:/lib:/usr/lib

15/02/21 00:00:26 INFO zookeeper.ZooKeeper: Client environment:java.io.tmpdir=/tmp

15/02/21 00:00:26 INFO zookeeper.ZooKeeper: Client environment:java.compiler=<NA>

15/02/21 00:00:26 INFO zookeeper.ZooKeeper: Client environment:os.name=Linux

15/02/21 00:00:26 INFO zookeeper.ZooKeeper: Client environment:os.arch=i386

15/02/21 00:00:26 INFO zookeeper.ZooKeeper: Client environment:os.version=3.13.0-36-lowlatency

15/02/21 00:00:26 INFO zookeeper.ZooKeeper: Client environment:user.name=jenkins

15/02/21 00:00:26 INFO zookeeper.ZooKeeper: Client environment:user.home=/home/jenkins

15/02/21 00:00:26 INFO zookeeper.ZooKeeper: Client environment:user.dir=/tmp

15/02/21 00:00:26 INFO zookeeper.ZooKeeper: Initiating client connection, connectString=localhost:20000
sessionTimeout=1200000 watcher=org.apache.hama.bsp.sync.ZKSyncBSPMasterClient@e5190a

15/02/21 00:00:26 INFO sync.ZKSyncBSPMasterClient: Initialized ZK false

15/02/21 00:00:26 INFO sync.ZKSyncClient: Initializing ZK Sync Client

15/02/21 00:00:26 INFO zookeeper.ClientCnxn: Opening socket connection to server localhost/0:0:0:0:0:0:0:1:20000.
Will not attempt to authenticate using SASL (unknown error)

15/02/21 00:00:26 INFO server.NIOServerCnxnFactory: Accepted socket connection from /0:0:0:0:0:0:0:1:45875

15/02/21 00:00:26 INFO zookeeper.ClientCnxn: Socket connection established to localhost/0:0:0:0:0:0:0:1:20000,
initiating session

15/02/21 00:00:26 INFO server.ZooKeeperServer: Client attempting to establish new session
at /0:0:0:0:0:0:0:1:45875

15/02/21 00:00:26 INFO persistence.FileTxnLog: Creating new log file: log.2ce

15/02/21 00:00:26 INFO server.ZooKeeperServer: Established session 0x14ba96f45dc0000 with
negotiated timeout 1200000 for client /0:0:0:0:0:0:0:1:45875

15/02/21 00:00:26 INFO zookeeper.ClientCnxn: Session establishment complete on server localhost/0:0:0:0:0:0:0:1:20000,
sessionid = 0x14ba96f45dc0000, negotiated timeout = 1200000

15/02/21 00:00:26 INFO mortbay.log: Logging to org.slf4j.impl.Log4jLoggerAdapter(org.mortbay.log)
via org.mortbay.log.Slf4jLog

15/02/21 00:00:26 INFO mortbay.log: Created master and client sync clients

15/02/21 00:00:26 INFO mortbay.log: BSP root exists

15/02/21 00:00:26 INFO zookeeper.ZooKeeper: Initiating client connection, connectString=localhost:20000
sessionTimeout=1200000 watcher=org.apache.hama.bsp.sync.ZooKeeperSyncClientImpl@3378

15/02/21 00:00:26 INFO sync.ZKSyncClient: Initializing ZK Sync Client

15/02/21 00:00:26 INFO zookeeper.ClientCnxn: Opening socket connection to server localhost/127.0.0.1:20000.
Will not attempt to authenticate using SASL (unknown error)

15/02/21 00:00:26 INFO sync.ZooKeeperSyncClientImpl: Start connecting to Zookeeper! At /0.0.0.0:21815

15/02/21 00:00:26 INFO zookeeper.ClientCnxn: Socket connection established to localhost/127.0.0.1:20000,
initiating session

15/02/21 00:00:26 INFO server.NIOServerCnxnFactory: Accepted socket connection from /127.0.0.1:37272

15/02/21 00:00:26 INFO server.ZooKeeperServer: Client attempting to establish new session
at /127.0.0.1:37272

15/02/21 00:00:26 INFO server.ZooKeeperServer: Established session 0x14ba96f45dc0001 with
negotiated timeout 1200000 for client /127.0.0.1:37272

15/02/21 00:00:26 INFO zookeeper.ClientCnxn: Session establishment complete on server localhost/127.0.0.1:20000,
sessionid = 0x14ba96f45dc0001, negotiated timeout = 1200000

15/02/21 00:00:26 INFO sync.ZKSyncClient: Writing data /bsp/job_test1_0001/info/level2

15/02/21 00:00:26 INFO mortbay.log: Found child count = 2

15/02/21 00:00:26 INFO mortbay.log: Passed the child count test

15/02/21 00:00:26 INFO mortbay.log: Found child count = 2

15/02/21 00:00:26 INFO mortbay.log:  Peer name 2

15/02/21 00:00:26 INFO mortbay.log:  Peer name 1

15/02/21 00:00:26 INFO mortbay.log: Passed the child key set test

15/02/21 00:00:26 INFO mortbay.log: /bsp/job_test1_0001

15/02/21 00:00:27 INFO mortbay.log: Passed the key presence test

15/02/21 00:00:27 INFO sync.ZKSyncClient: Writing data /bsp/job_test1_0001/info/level3

15/02/21 00:00:27 INFO mortbay.log: Passed array writable test

15/02/21 00:00:27 INFO server.NIOServerCnxn: Closed socket connection for client /127.0.0.1:37272
which had sessionid 0x14ba96f45dc0001

15/02/21 00:00:27 INFO zookeeper.ClientCnxn: Unable to read additional data from server sessionid
0x14ba96f45dc0001, likely server has closed socket, closing socket connection and attempting
reconnect

15/02/21 00:00:27 INFO server.NIOServerCnxn: Closed socket connection for client /0:0:0:0:0:0:0:1:45875
which had sessionid 0x14ba96f45dc0000

15/02/21 00:00:27 INFO zookeeper.ClientCnxn: Unable to read additional data from server sessionid
0x14ba96f45dc0000, likely server has closed socket, closing socket connection and attempting
reconnect

15/02/21 00:00:27 INFO server.NIOServerCnxnFactory: NIOServerCnxn factory exited run method

15/02/21 00:00:27 INFO server.ZooKeeperServer: shutting down

15/02/21 00:00:27 INFO server.ZooKeeperServer: shutting down

15/02/21 00:00:27 INFO server.SessionTrackerImpl: Shutting down

15/02/21 00:00:27 INFO server.PrepRequestProcessor: Shutting down

15/02/21 00:00:27 INFO server.SessionTrackerImpl: Shutting down

15/02/21 00:00:27 INFO server.PrepRequestProcessor: PrepRequestProcessor exited loop!

15/02/21 00:00:27 INFO server.PrepRequestProcessor: Shutting down

15/02/21 00:00:27 INFO server.SyncRequestProcessor: Shutting down

15/02/21 00:00:27 INFO server.SyncRequestProcessor: Shutting down

15/02/21 00:00:27 INFO server.SyncRequestProcessor: SyncRequestProcessor exited!

15/02/21 00:00:27 INFO server.FinalRequestProcessor: shutdown of request processor complete

15/02/21 00:00:27 INFO server.FinalRequestProcessor: shutdown of request processor complete

15/02/21 00:00:27 WARN jmx.MBeanRegistry: Failed to unregister MBean InMemoryDataTree

15/02/21 00:00:27 WARN jmx.MBeanRegistry: Error during unregister
javax.management.InstanceNotFoundException: org.apache.ZooKeeperService:name0=StandaloneServer_port-1,name1=InMemoryDataTree
	at com.sun.jmx.interceptor.DefaultMBeanServerInterceptor.getMBean(DefaultMBeanServerInterceptor.java:1095)
	at com.sun.jmx.interceptor.DefaultMBeanServerInterceptor.exclusiveUnregisterMBean(DefaultMBeanServerInterceptor.java:427)
	at com.sun.jmx.interceptor.DefaultMBeanServerInterceptor.unregisterMBean(DefaultMBeanServerInterceptor.java:415)
	at com.sun.jmx.mbeanserver.JmxMBeanServer.unregisterMBean(JmxMBeanServer.java:546)
	at org.apache.zookeeper.jmx.MBeanRegistry.unregister(MBeanRegistry.java:115)
	at org.apache.zookeeper.jmx.MBeanRegistry.unregister(MBeanRegistry.java:132)
	at org.apache.zookeeper.server.ZooKeeperServer.unregisterJMX(ZooKeeperServer.java:443)
	at org.apache.zookeeper.server.ZooKeeperServer.shutdown(ZooKeeperServer.java:436)
	at org.apache.zookeeper.server.ZooKeeperServerMain.runFromConfig(ZooKeeperServerMain.java:115)
	at org.apache.hama.bsp.sync.ZooKeeperSyncServerImpl.start(ZooKeeperSyncServerImpl.java:79)
	at org.apache.hama.bsp.TestZooKeeper$1.run(TestZooKeeper.java:76)
	at java.util.concurrent.Executors$RunnableAdapter.call(Executors.java:471)
	at java.util.concurrent.FutureTask$Sync.innerRun(FutureTask.java:334)
	at java.util.concurrent.FutureTask.run(FutureTask.java:166)
	at java.util.concurrent.ThreadPoolExecutor.runWorker(ThreadPoolExecutor.java:1145)
	at java.util.concurrent.ThreadPoolExecutor$Worker.run(ThreadPoolExecutor.java:615)
	at java.lang.Thread.run(Thread.java:724)

Tests run: 1, Failures: 0, Errors: 0, Skipped: 0, Time elapsed: 0.013 sec

Results :

Failed tests: 

Tests run: 66, Failures: 1, Errors: 0, Skipped: 0

[INFO] ------------------------------------------------------------------------
[INFO] Reactor Summary:
[INFO] 
[INFO] Apache Hama parent POM ............................ SUCCESS [4.104s]
[INFO] pipes ............................................. SUCCESS [16.785s]
[INFO] commons ........................................... SUCCESS [6.696s]
[INFO] core .............................................. FAILURE [2:45.960s]
[INFO] graph ............................................. SKIPPED
[INFO] machine learning .................................. SKIPPED
[INFO] examples .......................................... SKIPPED
[INFO] mesos ............................................. SKIPPED
[INFO] hama-dist ......................................... SKIPPED
[INFO] ------------------------------------------------------------------------
[INFO] BUILD FAILURE
[INFO] ------------------------------------------------------------------------
[INFO] Total time: 3:14.221s
[INFO] Finished at: Sat Feb 21 00:00:27 UTC 2015
[INFO] Final Memory: 56M/573M
[INFO] ------------------------------------------------------------------------
[ERROR] Failed to execute goal org.apache.maven.plugins:maven-surefire-plugin:2.6:test (default-test)
on project hama-core: There are test failures.
[ERROR] 
[ERROR] Please refer to <https://builds.apache.org/job/Hama-Nightly-for-Hadoop-1.x/ws/trunk/core/target/surefire-reports>
for the individual test results.
[ERROR] -> [Help 1]
[ERROR] 
[ERROR] To see the full stack trace of the errors, re-run Maven with the -e switch.
[ERROR] Re-run Maven using the -X switch to enable full debug logging.
[ERROR] 
[ERROR] For more information about the errors and possible solutions, please read the following
articles:
[ERROR] [Help 1] http://cwiki.apache.org/confluence/display/MAVEN/MojoFailureException
[ERROR] 
[ERROR] After correcting the problems, you can resume the build with the command
[ERROR]   mvn <goals> -rf :hama-core
Build step 'Invoke top-level Maven targets' marked build as failure
Archiving artifacts
Sending artifact delta relative to Hama-Nightly-for-Hadoop-1.x #1527
Archived 76 artifacts
Archive block size is 32768
Received 0 blocks and 253052 bytes
Compression is 0.0%
Took 2.7 sec
Recording test results

Mime
View raw message