hama-dev mailing list archives

Site index · List index
Message view « Date » · « Thread »
Top « Date » · « Thread »
From Apache Jenkins Server <jenk...@builds.apache.org>
Subject Build failed in Jenkins: Hama-Nightly-for-Hadoop-1.x #1512
Date Thu, 05 Feb 2015 00:05:20 GMT
See <https://builds.apache.org/job/Hama-Nightly-for-Hadoop-1.x/1512/>

------------------------------------------
[...truncated 124224 lines...]
[7.158014073587714, -4.0698586370952565, 5.492042357627455, 4.890028281733965, 3.1400140977420574,
-0.7379152591330594, -0.30398595818897933]	6.35530964587372
[7.150013866876974, -4.0998607754296525, 5.482041664974325, 4.876028014296917, 3.1180141824417045,
-0.7639164987581927, -0.33798572791174436]	6.131782268504843
[7.142013882031907, -4.129860794703656, 5.472041538621343, 4.862028388835388, 3.09601488571033,
-0.7899164074839112, -0.37198468063387413]	5.90827461359776
[7.134014199909772, -4.159858021315661, 5.462042086385522, 4.84802983631992, 3.0740168270731725,
-0.8159145003806193, -0.40598192743794786]	5.684788492460411
[7.126015107720446, -4.1898499010565375, 5.452043852379515, 4.834033565766788, 3.05202156320223,
-0.8419090545583884, -0.43997527682042126]	5.461339131380113
[7.11801733578837, -4.219829878769355, 5.442048280131357, 4.82004253196087, 3.0300328131581367,
-0.8678956887078861, -0.473959515179098]	5.23796853757739
[7.1100226297593, -4.2497822545565525, 5.432058851124702, 4.806063735799775, 3.0080593425992994,
-0.8938639300538058, -0.5079223665499674]	5.014778934940246
[7.10203508408036, -4.279670186149137, 5.422083748
402708, 4.792113564533352, 2.9861216440626746, -0.9197892138069559, -0.541835138835484]	4.792011704063929
[7.094064149371662, -4.309408625114272, 5.412141869325169, 4.778229824554746, 2.964266980841808,
-0.9456148394991056, -0.5756316615194502]	4.570228216084243
[7.086130978849286, -4.338807201271834, 5.402275517130851, 4.7644971285507856, 2.94260112270095,
-0.9712138933828114, -0.6091638550517424]	4.35070477467997
[7.078279787575417, -4.367467991903288, 5.392573118458076, 4.751092332714601, 2.9213451436250497,
-0.9963210944084716, -0.6421222134455117]	4.136204544458424
[7.070590165967807, -4.394674703108866, 5.383193849479623, 4.738333790121049, 2.900896989537819,
-1.0204589152235353, -0.6739496088942645]	3.9320992443258813
[7.063167338947803, -4.419480340330619, 5.374348153444877, 4.72664238634335, 2.881782773619096,
-1.0429960293855516, -0.7039094777967867]	3.746724152620719
[7.0560842347812, -4.441228589854085, 5.366181878052325, 4.716309814532597, 2.864367120496723,
-1.0634948990816013, -0.7314913386809223]	3.5882736744855825
[7.0560842347812, -4.441228589854085, 5.366181878052325, 4.716309814532597, 2.864367120496723,
-1.0634948990816013, -0.7314913386809223]	3.458803849984058

Job Finished in 3.22 seconds
Tests run: 1, Failures: 0, Errors: 0, Skipped: 0, Time elapsed: 0.01 sec
Running org.apache.hama.examples.BipartiteMatchingTest
15/02/05 00:05:02 WARN util.NativeCodeLoader: Unable to load native-hadoop library for your
platform... using builtin-java classes where applicable

15/02/05 00:05:02 INFO bsp.FileInputFormat: Total input paths to process : 1

15/02/05 00:05:02 WARN snappy.LoadSnappy: Snappy native library not loaded

15/02/05 00:05:02 INFO bsp.FileInputFormat: Total input paths to process : 1

15/02/05 00:05:02 WARN bsp.BSPJobClient: No job jar file set.  User classes may not be found.
See BSPJob#setJar(String) or check Your jar file.

15/02/05 00:05:02 INFO bsp.BSPJobClient: Running job: job_localrunner_0001

15/02/05 00:05:02 INFO bsp.LocalBSPRunner: Setting up a new barrier for 1 tasks!

15/02/05 00:05:05 INFO bsp.BSPJobClient: Current supersteps number: 1

15/02/05 00:05:05 INFO bsp.BSPJobClient: The total number of supersteps: 1

15/02/05 00:05:05 INFO bsp.BSPJobClient: Counters: 6

15/02/05 00:05:05 INFO bsp.BSPJobClient:   org.apache.hama.bsp.JobInProgress$JobCounter

15/02/05 00:05:05 INFO bsp.BSPJobClient:     SUPERSTEPS=1

15/02/05 00:05:05 INFO bsp.BSPJobClient:     LAUNCHED_TASKS=1

15/02/05 00:05:05 INFO bsp.BSPJobClient:   org.apache.hama.bsp.BSPPeerImpl$PeerCounter

15/02/05 00:05:05 INFO bsp.BSPJobClient:     SUPERSTEP_SUM=2

15/02/05 00:05:05 INFO bsp.BSPJobClient:     IO_BYTES_READ=26

15/02/05 00:05:05 INFO bsp.BSPJobClient:     TIME_IN_SYNC_MS=0

15/02/05 00:05:05 INFO bsp.BSPJobClient:     TASK_INPUT_RECORDS=4

15/02/05 00:05:05 INFO bsp.FileInputFormat: Total input paths to process : 2

15/02/05 00:05:05 WARN bsp.BSPJobClient: No job jar file set.  User classes may not be found.
See BSPJob#setJar(String) or check Your jar file.

15/02/05 00:05:05 INFO bsp.LocalBSPRunner: Setting up a new barrier for 2 tasks!

15/02/05 00:05:05 INFO bsp.BSPJobClient: Running job: job_localrunner_0001

15/02/05 00:05:05 INFO graph.GraphJobRunner: 2 vertices are loaded into local:1

15/02/05 00:05:05 INFO graph.GraphJobRunner: 2 vertices are loaded into local:0

15/02/05 00:05:08 INFO bsp.BSPJobClient: Current supersteps number: 7

15/02/05 00:05:08 INFO bsp.BSPJobClient: The total number of supersteps: 7

15/02/05 00:05:08 INFO bsp.BSPJobClient: Counters: 12

15/02/05 00:05:08 INFO bsp.BSPJobClient:   org.apache.hama.graph.GraphJobRunner$GraphJobCounter

15/02/05 00:05:08 INFO bsp.BSPJobClient:     ITERATIONS=6

15/02/05 00:05:08 INFO bsp.BSPJobClient:     INPUT_VERTICES=4

15/02/05 00:05:08 INFO bsp.BSPJobClient:   org.apache.hama.bsp.JobInProgress$JobCounter

15/02/05 00:05:08 INFO bsp.BSPJobClient:     SUPERSTEPS=7

15/02/05 00:05:08 INFO bsp.BSPJobClient:     LAUNCHED_TASKS=2

15/02/05 00:05:08 INFO bsp.BSPJobClient:   org.apache.hama.bsp.BSPPeerImpl$PeerCounter

15/02/05 00:05:08 INFO bsp.BSPJobClient:     SUPERSTEP_SUM=16

15/02/05 00:05:08 INFO bsp.BSPJobClient:     MESSAGE_BYTES_TRANSFERED=916

15/02/05 00:05:08 INFO bsp.BSPJobClient:     IO_BYTES_READ=90

15/02/05 00:05:08 INFO bsp.BSPJobClient:     TIME_IN_SYNC_MS=13

15/02/05 00:05:08 INFO bsp.BSPJobClient:     TOTAL_MESSAGES_SENT=38

15/02/05 00:05:08 INFO bsp.BSPJobClient:     TASK_INPUT_RECORDS=4

15/02/05 00:05:08 INFO bsp.BSPJobClient:     TOTAL_MESSAGES_RECEIVED=36

15/02/05 00:05:08 INFO bsp.BSPJobClient:     TASK_OUTPUT_RECORDS=4

Job Finished in 6.375 seconds
C -> D L expvalue = D L
A -> B L expvalue = B L
D -> C R expvalue = C R
B -> A R expvalue = A R
Tests run: 1, Failures: 0, Errors: 0, Skipped: 0, Time elapsed: 0.01 sec
Running org.apache.hama.examples.SemiClusterMatchingTest
15/02/05 00:05:09 WARN util.NativeCodeLoader: Unable to load native-hadoop library for your
platform... using builtin-java classes where applicable

15/02/05 00:05:09 INFO bsp.FileInputFormat: Total input paths to process : 1

15/02/05 00:05:09 WARN snappy.LoadSnappy: Snappy native library not loaded

15/02/05 00:05:09 INFO bsp.FileInputFormat: Total input paths to process : 1

15/02/05 00:05:09 WARN bsp.BSPJobClient: No job jar file set.  User classes may not be found.
See BSPJob#setJar(String) or check Your jar file.

15/02/05 00:05:09 INFO bsp.BSPJobClient: Running job: job_localrunner_0001

15/02/05 00:05:09 INFO bsp.LocalBSPRunner: Setting up a new barrier for 1 tasks!

15/02/05 00:05:12 INFO bsp.BSPJobClient: Current supersteps number: 1

15/02/05 00:05:12 INFO bsp.BSPJobClient: The total number of supersteps: 1

15/02/05 00:05:12 INFO bsp.BSPJobClient: Counters: 6

15/02/05 00:05:12 INFO bsp.BSPJobClient:   org.apache.hama.bsp.JobInProgress$JobCounter

15/02/05 00:05:12 INFO bsp.BSPJobClient:     SUPERSTEPS=1

15/02/05 00:05:12 INFO bsp.BSPJobClient:     LAUNCHED_TASKS=1

15/02/05 00:05:12 INFO bsp.BSPJobClient:   org.apache.hama.bsp.BSPPeerImpl$PeerCounter

15/02/05 00:05:12 INFO bsp.BSPJobClient:     SUPERSTEP_SUM=2

15/02/05 00:05:12 INFO bsp.BSPJobClient:     IO_BYTES_READ=7189

15/02/05 00:05:12 INFO bsp.BSPJobClient:     TIME_IN_SYNC_MS=1

15/02/05 00:05:12 INFO bsp.BSPJobClient:     TASK_INPUT_RECORDS=100

15/02/05 00:05:12 INFO bsp.FileInputFormat: Total input paths to process : 3

15/02/05 00:05:12 WARN bsp.BSPJobClient: No job jar file set.  User classes may not be found.
See BSPJob#setJar(String) or check Your jar file.

15/02/05 00:05:12 INFO bsp.LocalBSPRunner: Setting up a new barrier for 3 tasks!

15/02/05 00:05:12 INFO bsp.BSPJobClient: Running job: job_localrunner_0001

15/02/05 00:05:12 INFO graph.GraphJobRunner: 33 vertices are loaded into local:2

15/02/05 00:05:12 INFO graph.GraphJobRunner: 33 vertices are loaded into local:0

15/02/05 00:05:12 INFO graph.GraphJobRunner: 34 vertices are loaded into local:1

15/02/05 00:05:15 INFO bsp.BSPJobClient: Current supersteps number: 15

15/02/05 00:05:15 INFO bsp.BSPJobClient: The total number of supersteps: 15

15/02/05 00:05:15 INFO bsp.BSPJobClient: Counters: 12

15/02/05 00:05:15 INFO bsp.BSPJobClient:   org.apache.hama.graph.GraphJobRunner$GraphJobCounter

15/02/05 00:05:15 INFO bsp.BSPJobClient:     ITERATIONS=15

15/02/05 00:05:15 INFO bsp.BSPJobClient:     INPUT_VERTICES=100

15/02/05 00:05:15 INFO bsp.BSPJobClient:   org.apache.hama.bsp.JobInProgress$JobCounter

15/02/05 00:05:15 INFO bsp.BSPJobClient:     SUPERSTEPS=15

15/02/05 00:05:15 INFO bsp.BSPJobClient:     LAUNCHED_TASKS=3

15/02/05 00:05:15 INFO bsp.BSPJobClient:   org.apache.hama.bsp.BSPPeerImpl$PeerCounter

15/02/05 00:05:15 INFO bsp.BSPJobClient:     SUPERSTEP_SUM=48

15/02/05 00:05:15 INFO bsp.BSPJobClient:     MESSAGE_BYTES_TRANSFERED=27510393

15/02/05 00:05:15 INFO bsp.BSPJobClient:     IO_BYTES_READ=8850

15/02/05 00:05:15 INFO bsp.BSPJobClient:     TIME_IN_SYNC_MS=99

15/02/05 00:05:15 INFO bsp.BSPJobClient:     TOTAL_MESSAGES_SENT=181050

15/02/05 00:05:15 INFO bsp.BSPJobClient:     TASK_INPUT_RECORDS=100

15/02/05 00:05:15 INFO bsp.BSPJobClient:     TOTAL_MESSAGES_RECEIVED=4596

15/02/05 00:05:15 INFO bsp.BSPJobClient:     TASK_OUTPUT_RECORDS=100

Job Finished in 6.382 seconds
C1691 = [41, 44, 47, 42, 40, 43, 46, 49]
Tests run: 1, Failures: 1, Errors: 0, Skipped: 0, Time elapsed: 0.012 sec <<< FAILURE!

Results :

Failed tests: 
  testSemiClustering(org.apache.hama.examples.SemiClusterMatchingTest)

Tests run: 21, Failures: 1, Errors: 0, Skipped: 0

[INFO] ------------------------------------------------------------------------
[INFO] Reactor Summary:
[INFO] 
[INFO] Apache Hama parent POM ............................ SUCCESS [33.880s]
[INFO] pipes ............................................. SUCCESS [23.904s]
[INFO] commons ........................................... SUCCESS [11.584s]
[INFO] core .............................................. SUCCESS [3:13.320s]
[INFO] graph ............................................. SUCCESS [18.451s]
[INFO] machine learning .................................. SUCCESS [1:44.640s]
[INFO] examples .......................................... FAILURE [1:35.685s]
[INFO] mesos ............................................. SKIPPED
[INFO] hama-dist ......................................... SKIPPED
[INFO] ------------------------------------------------------------------------
[INFO] BUILD FAILURE
[INFO] ------------------------------------------------------------------------
[INFO] Total time: 8:04.116s
[INFO] Finished at: Thu Feb 05 00:05:15 UTC 2015
[INFO] Final Memory: 94M/254M
[INFO] ------------------------------------------------------------------------
[ERROR] Failed to execute goal org.apache.maven.plugins:maven-surefire-plugin:2.6:test (default-test)
on project hama-examples: There are test failures.
[ERROR] 
[ERROR] Please refer to <https://builds.apache.org/job/Hama-Nightly-for-Hadoop-1.x/ws/trunk/examples/target/surefire-reports>
for the individual test results.
[ERROR] -> [Help 1]
[ERROR] 
[ERROR] To see the full stack trace of the errors, re-run Maven with the -e switch.
[ERROR] Re-run Maven using the -X switch to enable full debug logging.
[ERROR] 
[ERROR] For more information about the errors and possible solutions, please read the following
articles:
[ERROR] [Help 1] http://cwiki.apache.org/confluence/display/MAVEN/MojoFailureException
[ERROR] 
[ERROR] After correcting the problems, you can resume the build with the command
[ERROR]   mvn <goals> -rf :hama-examples
Build step 'Invoke top-level Maven targets' marked build as failure
Archiving artifacts
Sending artifact delta relative to Hama-Nightly-for-Hadoop-1.x #1510
Archived 148 artifacts
Archive block size is 32768
Received 0 blocks and 417091 bytes
Compression is 0.0%
Took 3.6 sec
Recording test results

Mime
View raw message