hama-dev mailing list archives

Site index · List index
Message view « Date » · « Thread »
Top « Date » · « Thread »
From Apache Jenkins Server <jenk...@builds.apache.org>
Subject Build failed in Jenkins: Hama-Nightly-for-Hadoop-1.x #1514
Date Sat, 07 Feb 2015 00:04:33 GMT
See <https://builds.apache.org/job/Hama-Nightly-for-Hadoop-1.x/1514/>

------------------------------------------
[...truncated 105558 lines...]
D -> C R expvalue = C R
B -> A R expvalue = A R
Tests run: 1, Failures: 0, Errors: 0, Skipped: 0, Time elapsed: 0.011 sec
Running org.apache.hama.examples.MaxFlowTest
15/02/07 00:04:13 WARN util.NativeCodeLoader: Unable to load native-hadoop library for your
platform... using builtin-java classes where applicable

15/02/07 00:04:13 INFO compress.CodecPool: Got brand-new compressor

 0.0 1.0 16.0
 1.0 0.0 -16.0
 1.0 3.0 12.0
 3.0 1.0 -12.0
 3.0 5.0 20.0
 5.0 3.0 -20.0
 2.0 1.0 4.0
 1.0 2.0 -4.0
 3.0 2.0 9.0
 2.0 3.0 -9.0
 4.0 3.0 7.0
 3.0 4.0 -7.0
 0.0 2.0 13.0
 2.0 0.0 -13.0
 2.0 4.0 14.0
 4.0 2.0 -14.0
 4.0 5.0 4.0
 5.0 4.0 -4.0
15/02/07 00:04:13 INFO bsp.FileInputFormat: Total input paths to process : 1

15/02/07 00:04:13 INFO bsp.FileInputFormat: Total input paths to process : 1

15/02/07 00:04:13 WARN bsp.BSPJobClient: No job jar file set.  User classes may not be found.
See BSPJob#setJar(String) or check Your jar file.

15/02/07 00:04:14 INFO bsp.BSPJobClient: Running job: job_localrunner_0001

15/02/07 00:04:14 INFO compress.CodecPool: Got brand-new decompressor

15/02/07 00:04:14 INFO bsp.LocalBSPRunner: Setting up a new barrier for 1 tasks!

15/02/07 00:04:17 INFO bsp.BSPJobClient: Current supersteps number: 1

15/02/07 00:04:17 INFO bsp.BSPJobClient: The total number of supersteps: 1

15/02/07 00:04:17 INFO bsp.BSPJobClient: Counters: 6

15/02/07 00:04:17 INFO bsp.BSPJobClient:   org.apache.hama.bsp.JobInProgress$JobCounter

15/02/07 00:04:17 INFO bsp.BSPJobClient:     SUPERSTEPS=1

15/02/07 00:04:17 INFO bsp.BSPJobClient:     LAUNCHED_TASKS=1

15/02/07 00:04:17 INFO bsp.BSPJobClient:   org.apache.hama.bsp.BSPPeerImpl$PeerCounter

15/02/07 00:04:17 INFO bsp.BSPJobClient:     SUPERSTEP_SUM=2

15/02/07 00:04:17 INFO bsp.BSPJobClient:     IO_BYTES_READ=562

15/02/07 00:04:17 INFO bsp.BSPJobClient:     TIME_IN_SYNC_MS=0

15/02/07 00:04:17 INFO bsp.BSPJobClient:     TASK_INPUT_RECORDS=18

15/02/07 00:04:17 INFO bsp.FileInputFormat: Total input paths to process : 3

15/02/07 00:04:17 WARN bsp.BSPJobClient: No job jar file set.  User classes may not be found.
See BSPJob#setJar(String) or check Your jar file.

15/02/07 00:04:17 INFO bsp.LocalBSPRunner: Setting up a new barrier for 3 tasks!

15/02/07 00:04:17 INFO bsp.BSPJobClient: Running job: job_localrunner_0001

15/02/07 00:04:17 INFO graph.GraphJobRunner: 2 vertices are loaded into local:2

15/02/07 00:04:17 INFO graph.GraphJobRunner: 2 vertices are loaded into local:1

15/02/07 00:04:17 INFO graph.GraphJobRunner: 2 vertices are loaded into local:0

maxFlow is: 23.0
15/02/07 00:04:17 ERROR bsp.LocalBSPRunner: Exception during BSP execution!
java.util.concurrent.ExecutionException: java.lang.AssertionError: vertex value cannot be
null
	at java.util.concurrent.FutureTask$Sync.innerGet(FutureTask.java:252)
	at java.util.concurrent.FutureTask.get(FutureTask.java:111)
	at org.apache.hama.bsp.LocalBSPRunner$ThreadObserver.run(LocalBSPRunner.java:315)
	at java.lang.Thread.run(Thread.java:724)
Caused by: java.lang.AssertionError: vertex value cannot be null
	at org.apache.hama.graph.DefaultVertexOutputWriter.write(DefaultVertexOutputWriter.java:49)
	at org.apache.hama.graph.GraphJobRunner.cleanup(GraphJobRunner.java:172)
	at org.apache.hama.bsp.LocalBSPRunner$BSPRunner.run(LocalBSPRunner.java:264)
	at org.apache.hama.bsp.LocalBSPRunner$BSPRunner.call(LocalBSPRunner.java:288)
	at org.apache.hama.bsp.LocalBSPRunner$BSPRunner.call(LocalBSPRunner.java:212)
	at java.util.concurrent.FutureTask$Sync.innerRun(FutureTask.java:334)
	at java.util.concurrent.FutureTask.run(FutureTask.java:166)
	at java.util.concurrent.Executors$RunnableAdapter.call(Executors.java:471)
	at java.util.concurrent.FutureTask$Sync.innerRun(FutureTask.java:334)
	at java.util.concurrent.FutureTask.run(FutureTask.java:166)
	at java.util.concurrent.ThreadPoolExecutor.runWorker(ThreadPoolExecutor.java:1145)
	at java.util.concurrent.ThreadPoolExecutor$Worker.run(ThreadPoolExecutor.java:615)
	... 1 more

15/02/07 00:04:20 INFO bsp.BSPJobClient: Current supersteps number: 42

15/02/07 00:04:20 INFO bsp.BSPJobClient: Job failed.

maxflow is: 23.0
Tests run: 1, Failures: 0, Errors: 0, Skipped: 0, Time elapsed: 0.008 sec
Running org.apache.hama.examples.SemiClusterMatchingTest
15/02/07 00:04:21 WARN util.NativeCodeLoader: Unable to load native-hadoop library for your
platform... using builtin-java classes where applicable

15/02/07 00:04:21 INFO bsp.FileInputFormat: Total input paths to process : 1

15/02/07 00:04:21 WARN snappy.LoadSnappy: Snappy native library not loaded

15/02/07 00:04:21 INFO bsp.FileInputFormat: Total input paths to process : 1

15/02/07 00:04:21 WARN bsp.BSPJobClient: No job jar file set.  User classes may not be found.
See BSPJob#setJar(String) or check Your jar file.

15/02/07 00:04:21 INFO bsp.BSPJobClient: Running job: job_localrunner_0001

15/02/07 00:04:21 INFO bsp.LocalBSPRunner: Setting up a new barrier for 1 tasks!

15/02/07 00:04:24 INFO bsp.BSPJobClient: Current supersteps number: 1

15/02/07 00:04:24 INFO bsp.BSPJobClient: The total number of supersteps: 1

15/02/07 00:04:24 INFO bsp.BSPJobClient: Counters: 6

15/02/07 00:04:24 INFO bsp.BSPJobClient:   org.apache.hama.bsp.JobInProgress$JobCounter

15/02/07 00:04:24 INFO bsp.BSPJobClient:     SUPERSTEPS=1

15/02/07 00:04:24 INFO bsp.BSPJobClient:     LAUNCHED_TASKS=1

15/02/07 00:04:24 INFO bsp.BSPJobClient:   org.apache.hama.bsp.BSPPeerImpl$PeerCounter

15/02/07 00:04:24 INFO bsp.BSPJobClient:     SUPERSTEP_SUM=2

15/02/07 00:04:24 INFO bsp.BSPJobClient:     IO_BYTES_READ=7189

15/02/07 00:04:24 INFO bsp.BSPJobClient:     TIME_IN_SYNC_MS=0

15/02/07 00:04:24 INFO bsp.BSPJobClient:     TASK_INPUT_RECORDS=100

15/02/07 00:04:24 INFO bsp.FileInputFormat: Total input paths to process : 3

15/02/07 00:04:24 WARN bsp.BSPJobClient: No job jar file set.  User classes may not be found.
See BSPJob#setJar(String) or check Your jar file.

15/02/07 00:04:24 INFO bsp.LocalBSPRunner: Setting up a new barrier for 3 tasks!

15/02/07 00:04:24 INFO bsp.BSPJobClient: Running job: job_localrunner_0001

15/02/07 00:04:24 INFO graph.GraphJobRunner: 33 vertices are loaded into local:0

15/02/07 00:04:24 INFO graph.GraphJobRunner: 34 vertices are loaded into local:1

15/02/07 00:04:24 INFO graph.GraphJobRunner: 33 vertices are loaded into local:2

15/02/07 00:04:27 INFO bsp.BSPJobClient: Current supersteps number: 15

15/02/07 00:04:27 INFO bsp.BSPJobClient: The total number of supersteps: 15

15/02/07 00:04:27 INFO bsp.BSPJobClient: Counters: 12

15/02/07 00:04:27 INFO bsp.BSPJobClient:   org.apache.hama.graph.GraphJobRunner$GraphJobCounter

15/02/07 00:04:27 INFO bsp.BSPJobClient:     ITERATIONS=15

15/02/07 00:04:27 INFO bsp.BSPJobClient:     INPUT_VERTICES=100

15/02/07 00:04:27 INFO bsp.BSPJobClient:   org.apache.hama.bsp.JobInProgress$JobCounter

15/02/07 00:04:27 INFO bsp.BSPJobClient:     SUPERSTEPS=15

15/02/07 00:04:27 INFO bsp.BSPJobClient:     LAUNCHED_TASKS=3

15/02/07 00:04:27 INFO bsp.BSPJobClient:   org.apache.hama.bsp.BSPPeerImpl$PeerCounter

15/02/07 00:04:27 INFO bsp.BSPJobClient:     SUPERSTEP_SUM=48

15/02/07 00:04:27 INFO bsp.BSPJobClient:     MESSAGE_BYTES_TRANSFERED=24655041

15/02/07 00:04:27 INFO bsp.BSPJobClient:     IO_BYTES_READ=8850

15/02/07 00:04:27 INFO bsp.BSPJobClient:     TIME_IN_SYNC_MS=215

15/02/07 00:04:27 INFO bsp.BSPJobClient:     TOTAL_MESSAGES_SENT=166202

15/02/07 00:04:27 INFO bsp.BSPJobClient:     TASK_INPUT_RECORDS=100

15/02/07 00:04:27 INFO bsp.BSPJobClient:     TOTAL_MESSAGES_RECEIVED=4596

15/02/07 00:04:27 INFO bsp.BSPJobClient:     TASK_OUTPUT_RECORDS=100

Job Finished in 6.388 seconds
C1691 = [41, 44, 47, 42, 45, 48, 40, 43, 46, 49]
C1598 = [14, 17, 11, 18, 15, 12, 19, 16, 10, 13]
C1784 = [77, 74, 71, 78, 72, 75, 79, 76, 73, 70]
C1722 = [56, 59, 50, 53, 57, 54, 51, 55, 58, 52]
C1815 = [86, 83, 80, 89, 84, 81, 87, 85, 82, 88]
C79 = [5, 8, 2, 0, 6, 3, 9, 7, 1, 4]
C1753 = [62, 65, 68, 60, 63, 69, 66, 64, 61, 67]
C1629 = [26, 20, 23, 29, 27, 21, 24, 25, 28, 22]
C1846 = [98, 92, 95, 99, 90, 93, 96, 91, 94, 97]
C1660 = [38, 35, 32, 39, 36, 33, 30, 37, 34, 31]
Tests run: 1, Failures: 0, Errors: 0, Skipped: 0, Time elapsed: 0.007 sec

Results :

Failed tests: 

Tests run: 21, Failures: 1, Errors: 0, Skipped: 0

[INFO] ------------------------------------------------------------------------
[INFO] Reactor Summary:
[INFO] 
[INFO] Apache Hama parent POM ............................ SUCCESS [5.395s]
[INFO] pipes ............................................. SUCCESS [16.795s]
[INFO] commons ........................................... SUCCESS [6.797s]
[INFO] core .............................................. SUCCESS [3:01.599s]
[INFO] graph ............................................. SUCCESS [18.262s]
[INFO] machine learning .................................. SUCCESS [1:48.349s]
[INFO] examples .......................................... FAILURE [1:35.725s]
[INFO] mesos ............................................. SKIPPED
[INFO] hama-dist ......................................... SKIPPED
[INFO] ------------------------------------------------------------------------
[INFO] BUILD FAILURE
[INFO] ------------------------------------------------------------------------
[INFO] Total time: 7:13.647s
[INFO] Finished at: Sat Feb 07 00:04:27 UTC 2015
[INFO] Final Memory: 99M/570M
[INFO] ------------------------------------------------------------------------
[ERROR] Failed to execute goal org.apache.maven.plugins:maven-surefire-plugin:2.6:test (default-test)
on project hama-examples: There are test failures.
[ERROR] 
[ERROR] Please refer to <https://builds.apache.org/job/Hama-Nightly-for-Hadoop-1.x/ws/trunk/examples/target/surefire-reports>
for the individual test results.
[ERROR] -> [Help 1]
[ERROR] 
[ERROR] To see the full stack trace of the errors, re-run Maven with the -e switch.
[ERROR] Re-run Maven using the -X switch to enable full debug logging.
[ERROR] 
[ERROR] For more information about the errors and possible solutions, please read the following
articles:
[ERROR] [Help 1] http://cwiki.apache.org/confluence/display/MAVEN/MojoFailureException
[ERROR] 
[ERROR] After correcting the problems, you can resume the build with the command
[ERROR]   mvn <goals> -rf :hama-examples
Build step 'Invoke top-level Maven targets' marked build as failure
Archiving artifacts
Sending artifact delta relative to Hama-Nightly-for-Hadoop-1.x #1513
Archived 150 artifacts
Archive block size is 32768
Received 1070 blocks and 469764 bytes
Compression is 98.7%
Took 4 sec
Recording test results

Mime
View raw message