hama-dev mailing list archives

Site index · List index
Message view « Date » · « Thread »
Top « Date » · « Thread »
From Apache Jenkins Server <jenk...@builds.apache.org>
Subject Build failed in Jenkins: Hama-Nightly-for-Hadoop-1.x #1494
Date Sat, 17 Jan 2015 00:02:06 GMT
See <https://builds.apache.org/job/Hama-Nightly-for-Hadoop-1.x/1494/>

------------------------------------------
[...truncated 23334 lines...]
15/01/17 00:01:43 INFO bsp.BSPJobClient:     SUPERSTEPS=14

15/01/17 00:01:43 INFO bsp.BSPJobClient:     LAUNCHED_TASKS=3

15/01/17 00:01:43 INFO bsp.BSPJobClient:   org.apache.hama.bsp.BSPPeerImpl$PeerCounter

15/01/17 00:01:43 INFO bsp.BSPJobClient:     SUPERSTEP_SUM=45

15/01/17 00:01:43 INFO bsp.BSPJobClient:     MESSAGE_BYTES_TRANSFERED=2565

15/01/17 00:01:43 INFO bsp.BSPJobClient:     TIME_IN_SYNC_MS=15

15/01/17 00:01:43 INFO bsp.BSPJobClient:     TOTAL_MESSAGES_SENT=135

15/01/17 00:01:43 INFO bsp.BSPJobClient:     TOTAL_MESSAGES_RECEIVED=135

15/01/17 00:01:43 INFO bsp.BSPJobClient:     TASK_OUTPUT_RECORDS=135

Tests run: 1, Failures: 0, Errors: 0, Skipped: 0, Time elapsed: 0.008 sec
Running org.apache.hama.bsp.message.TestSpillingQueue
Tests run: 2, Failures: 0, Errors: 0, Skipped: 0, Time elapsed: 0.009 sec
Running org.apache.hama.zookeeper.TestZKTools
Tests run: 1, Failures: 0, Errors: 0, Skipped: 0, Time elapsed: 0.01 sec
Running org.apache.hama.bsp.TestZooKeeper
15/01/17 00:01:56 ERROR quorum.QuorumPeerConfig: Invalid configuration, only one server specified
(ignoring)

15/01/17 00:01:56 INFO server.ZooKeeperServerMain: Starting server

15/01/17 00:01:56 INFO server.ZooKeeperServer: Server environment:zookeeper.version=3.4.5-1392090,
built on 09/30/2012 17:52 GMT

15/01/17 00:01:56 INFO server.ZooKeeperServer: Server environment:host.name=asf910.gq1.ygridcore.net

15/01/17 00:01:56 INFO server.ZooKeeperServer: Server environment:java.version=1.7.0_25

15/01/17 00:01:56 INFO server.ZooKeeperServer: Server environment:java.vendor=Oracle Corporation

15/01/17 00:01:56 INFO server.ZooKeeperServer: Server environment:java.home=/home/jenkins/tools/java/jdk1.7.0_25-32/jre

15/01/17 00:01:56 INFO server.ZooKeeperServer: Server environment:java.class.path=/tmp/surefirebooter7622058335676815285.jar

15/01/17 00:01:56 INFO server.ZooKeeperServer: Server environment:java.library.path=/usr/java/packages/lib/i386:/lib:/usr/lib

15/01/17 00:01:56 INFO server.ZooKeeperServer: Server environment:java.io.tmpdir=/tmp

15/01/17 00:01:56 INFO server.ZooKeeperServer: Server environment:java.compiler=<NA>

15/01/17 00:01:56 INFO server.ZooKeeperServer: Server environment:os.name=Linux

15/01/17 00:01:56 INFO server.ZooKeeperServer: Server environment:os.arch=i386

15/01/17 00:01:56 INFO server.ZooKeeperServer: Server environment:os.version=3.13.0-36-lowlatency

15/01/17 00:01:56 INFO server.ZooKeeperServer: Server environment:user.name=jenkins

15/01/17 00:01:56 INFO server.ZooKeeperServer: Server environment:user.home=/home/jenkins

15/01/17 00:01:56 INFO server.ZooKeeperServer: Server environment:user.dir=/tmp

15/01/17 00:01:56 INFO server.ZooKeeperServer: tickTime set to 3000

15/01/17 00:01:56 INFO server.ZooKeeperServer: minSessionTimeout set to -1

15/01/17 00:01:56 INFO server.ZooKeeperServer: maxSessionTimeout set to 1200000

15/01/17 00:01:56 INFO server.NIOServerCnxnFactory: binding to port 0.0.0.0/0.0.0.0:20000

15/01/17 00:01:56 INFO persistence.FileSnap: Reading snapshot /tmp/hama-testzookeeper/version-2/snapshot.0

15/01/17 00:01:56 INFO persistence.FileTxnSnapLog: Snapshotting: 0x6 to /tmp/hama-testzookeeper/version-2/snapshot.6

15/01/17 00:02:00 INFO zookeeper.ZooKeeper: Client environment:zookeeper.version=3.4.5-1392090,
built on 09/30/2012 17:52 GMT

15/01/17 00:02:00 INFO zookeeper.ZooKeeper: Client environment:host.name=asf910.gq1.ygridcore.net

15/01/17 00:02:00 INFO zookeeper.ZooKeeper: Client environment:java.version=1.7.0_25

15/01/17 00:02:00 INFO zookeeper.ZooKeeper: Client environment:java.vendor=Oracle Corporation

15/01/17 00:02:00 INFO zookeeper.ZooKeeper: Client environment:java.home=/home/jenkins/tools/java/jdk1.7.0_25-32/jre

15/01/17 00:02:00 INFO zookeeper.ZooKeeper: Client environment:java.class.path=/tmp/surefirebooter7622058335676815285.jar

15/01/17 00:02:00 INFO zookeeper.ZooKeeper: Client environment:java.library.path=/usr/java/packages/lib/i386:/lib:/usr/lib

15/01/17 00:02:00 INFO zookeeper.ZooKeeper: Client environment:java.io.tmpdir=/tmp

15/01/17 00:02:00 INFO zookeeper.ZooKeeper: Client environment:java.compiler=<NA>

15/01/17 00:02:00 INFO zookeeper.ZooKeeper: Client environment:os.name=Linux

15/01/17 00:02:00 INFO zookeeper.ZooKeeper: Client environment:os.arch=i386

15/01/17 00:02:00 INFO zookeeper.ZooKeeper: Client environment:os.version=3.13.0-36-lowlatency

15/01/17 00:02:00 INFO zookeeper.ZooKeeper: Client environment:user.name=jenkins

15/01/17 00:02:00 INFO zookeeper.ZooKeeper: Client environment:user.home=/home/jenkins

15/01/17 00:02:00 INFO zookeeper.ZooKeeper: Client environment:user.dir=/tmp

15/01/17 00:02:00 INFO zookeeper.ZooKeeper: Initiating client connection, connectString=localhost:20000
sessionTimeout=1200000 watcher=org.apache.hama.bsp.sync.ZKSyncBSPMasterClient@1b8935b

15/01/17 00:02:00 INFO sync.ZKSyncBSPMasterClient: Initialized ZK false

15/01/17 00:02:00 INFO sync.ZKSyncClient: Initializing ZK Sync Client

15/01/17 00:02:00 INFO zookeeper.ClientCnxn: Opening socket connection to server localhost/127.0.0.1:20000.
Will not attempt to authenticate using SASL (unknown error)

15/01/17 00:02:00 INFO zookeeper.ClientCnxn: Socket connection established to localhost/127.0.0.1:20000,
initiating session

15/01/17 00:02:00 INFO server.NIOServerCnxnFactory: Accepted socket connection from /127.0.0.1:59823

15/01/17 00:02:00 INFO server.ZooKeeperServer: Client attempting to establish new session
at /127.0.0.1:59823

15/01/17 00:02:00 INFO persistence.FileTxnLog: Creating new log file: log.7

15/01/17 00:02:00 INFO server.ZooKeeperServer: Established session 0x14af53238120000 with
negotiated timeout 1200000 for client /127.0.0.1:59823

15/01/17 00:02:00 INFO zookeeper.ClientCnxn: Session establishment complete on server localhost/127.0.0.1:20000,
sessionid = 0x14af53238120000, negotiated timeout = 1200000

15/01/17 00:02:00 INFO mortbay.log: Logging to org.slf4j.impl.Log4jLoggerAdapter(org.mortbay.log)
via org.mortbay.log.Slf4jLog

15/01/17 00:02:00 INFO mortbay.log: Created master and client sync clients

15/01/17 00:02:00 INFO mortbay.log: BSP root exists

15/01/17 00:02:00 INFO zookeeper.ZooKeeper: Initiating client connection, connectString=localhost:20000
sessionTimeout=1200000 watcher=org.apache.hama.bsp.sync.ZooKeeperSyncClientImpl@17e4f49

15/01/17 00:02:00 INFO sync.ZKSyncClient: Initializing ZK Sync Client

15/01/17 00:02:00 INFO zookeeper.ClientCnxn: Opening socket connection to server localhost/127.0.0.1:20000.
Will not attempt to authenticate using SASL (unknown error)

15/01/17 00:02:00 INFO sync.ZooKeeperSyncClientImpl: Start connecting to Zookeeper! At /0.0.0.0:21815

15/01/17 00:02:00 INFO zookeeper.ClientCnxn: Socket connection established to localhost/127.0.0.1:20000,
initiating session

15/01/17 00:02:00 INFO server.NIOServerCnxnFactory: Accepted socket connection from /127.0.0.1:59825

15/01/17 00:02:00 INFO server.ZooKeeperServer: Client attempting to establish new session
at /127.0.0.1:59825

15/01/17 00:02:00 INFO server.ZooKeeperServer: Established session 0x14af53238120001 with
negotiated timeout 1200000 for client /127.0.0.1:59825

15/01/17 00:02:00 INFO zookeeper.ClientCnxn: Session establishment complete on server localhost/127.0.0.1:20000,
sessionid = 0x14af53238120001, negotiated timeout = 1200000

15/01/17 00:02:00 INFO sync.ZKSyncClient: Writing data /bsp/job_test1_0001/info/level2

15/01/17 00:02:00 INFO mortbay.log: Found child count = 2

15/01/17 00:02:00 INFO mortbay.log: Passed the child count test

15/01/17 00:02:00 INFO mortbay.log: Found child count = 2

15/01/17 00:02:00 INFO mortbay.log:  Peer name 2

15/01/17 00:02:00 INFO mortbay.log:  Peer name 1

15/01/17 00:02:00 INFO mortbay.log: Passed the child key set test

15/01/17 00:02:00 INFO mortbay.log: /bsp/job_test1_0001

15/01/17 00:02:00 INFO mortbay.log: Passed the key presence test

15/01/17 00:02:00 INFO sync.ZKSyncClient: Writing data /bsp/job_test1_0001/info/level3

15/01/17 00:02:01 INFO mortbay.log: Passed array writable test

15/01/17 00:02:01 INFO server.NIOServerCnxn: Closed socket connection for client /127.0.0.1:59823
which had sessionid 0x14af53238120000

15/01/17 00:02:01 INFO zookeeper.ClientCnxn: Unable to read additional data from server sessionid
0x14af53238120000, likely server has closed socket, closing socket connection and attempting
reconnect

15/01/17 00:02:01 INFO server.NIOServerCnxn: Closed socket connection for client /127.0.0.1:59825
which had sessionid 0x14af53238120001

15/01/17 00:02:01 INFO zookeeper.ClientCnxn: Unable to read additional data from server sessionid
0x14af53238120001, likely server has closed socket, closing socket connection and attempting
reconnect

15/01/17 00:02:01 INFO server.NIOServerCnxnFactory: NIOServerCnxn factory exited run method

15/01/17 00:02:01 INFO server.ZooKeeperServer: shutting down

15/01/17 00:02:01 INFO server.SessionTrackerImpl: Shutting down

15/01/17 00:02:01 INFO server.ZooKeeperServer: shutting down

15/01/17 00:02:01 INFO server.PrepRequestProcessor: Shutting down

15/01/17 00:02:01 INFO server.SessionTrackerImpl: Shutting down

15/01/17 00:02:01 INFO server.SyncRequestProcessor: Shutting down

15/01/17 00:02:01 INFO server.PrepRequestProcessor: PrepRequestProcessor exited loop!

15/01/17 00:02:01 INFO server.SyncRequestProcessor: SyncRequestProcessor exited!

15/01/17 00:02:01 INFO server.PrepRequestProcessor: Shutting down

15/01/17 00:02:01 INFO server.FinalRequestProcessor: shutdown of request processor complete

15/01/17 00:02:01 INFO server.SyncRequestProcessor: Shutting down

15/01/17 00:02:01 INFO server.FinalRequestProcessor: shutdown of request processor complete

Tests run: 1, Failures: 0, Errors: 0, Skipped: 0, Time elapsed: 0.014 sec

Results :

Failed tests: 

Tests run: 74, Failures: 1, Errors: 0, Skipped: 0

[INFO] ------------------------------------------------------------------------
[INFO] Reactor Summary:
[INFO] 
[INFO] Apache Hama parent POM ............................ SUCCESS [27.690s]
[INFO] pipes ............................................. SUCCESS [23.423s]
[INFO] commons ........................................... SUCCESS [9.769s]
[INFO] core .............................................. FAILURE [3:46.266s]
[INFO] graph ............................................. SKIPPED
[INFO] machine learning .................................. SKIPPED
[INFO] examples .......................................... SKIPPED
[INFO] mesos ............................................. SKIPPED
[INFO] hama-dist ......................................... SKIPPED
[INFO] ------------------------------------------------------------------------
[INFO] BUILD FAILURE
[INFO] ------------------------------------------------------------------------
[INFO] Total time: 4:50.966s
[INFO] Finished at: Sat Jan 17 00:02:01 UTC 2015
[INFO] Final Memory: 52M/226M
[INFO] ------------------------------------------------------------------------
[ERROR] Failed to execute goal org.apache.maven.plugins:maven-surefire-plugin:2.6:test (default-test)
on project hama-core: There are test failures.
[ERROR] 
[ERROR] Please refer to <https://builds.apache.org/job/Hama-Nightly-for-Hadoop-1.x/ws/trunk/core/target/surefire-reports>
for the individual test results.
[ERROR] -> [Help 1]
[ERROR] 
[ERROR] To see the full stack trace of the errors, re-run Maven with the -e switch.
[ERROR] Re-run Maven using the -X switch to enable full debug logging.
[ERROR] 
[ERROR] For more information about the errors and possible solutions, please read the following
articles:
[ERROR] [Help 1] http://cwiki.apache.org/confluence/display/MAVEN/MojoFailureException
[ERROR] 
[ERROR] After correcting the problems, you can resume the build with the command
[ERROR]   mvn <goals> -rf :hama-core
Build step 'Invoke top-level Maven targets' marked build as failure
Archiving artifacts
Sending artifact delta relative to Hama-Nightly-for-Hadoop-1.x #1493
Archived 80 artifacts
Archive block size is 32768
Received 0 blocks and 264059 bytes
Compression is 0.0%
Took 3 sec
Recording test results

Mime
View raw message