hama-dev mailing list archives

Site index · List index
Message view « Date » · « Thread »
Top « Date » · « Thread »
From Apache Jenkins Server <jenk...@builds.apache.org>
Subject Build failed in Jenkins: Hama-Nightly-for-Hadoop-1.x #1337
Date Thu, 14 Aug 2014 01:26:38 GMT
See <https://builds.apache.org/job/Hama-Nightly-for-Hadoop-1.x/1337/changes>

Changes:

[edwardyoon] cleanup queue impls

------------------------------------------
[...truncated 23736 lines...]
14/08/14 01:25:02 INFO bsp.BSPJobClient: Running job: job_localrunner_0001

14/08/14 01:25:02 INFO bsp.LocalBSPRunner: Setting up a new barrier for 3 tasks!

14/08/14 01:25:05 INFO bsp.BSPJobClient: Current supersteps number: 14

14/08/14 01:25:05 INFO bsp.BSPJobClient: The total number of supersteps: 14

14/08/14 01:25:05 INFO bsp.BSPJobClient: Counters: 8

14/08/14 01:25:05 INFO bsp.BSPJobClient:   org.apache.hama.bsp.JobInProgress$JobCounter

14/08/14 01:25:05 INFO bsp.BSPJobClient:     SUPERSTEPS=14

14/08/14 01:25:05 INFO bsp.BSPJobClient:     LAUNCHED_TASKS=3

14/08/14 01:25:05 INFO bsp.BSPJobClient:   org.apache.hama.bsp.BSPPeerImpl$PeerCounter

14/08/14 01:25:05 INFO bsp.BSPJobClient:     SUPERSTEP_SUM=45

14/08/14 01:25:05 INFO bsp.BSPJobClient:     MESSAGE_BYTES_TRANSFERED=2565

14/08/14 01:25:05 INFO bsp.BSPJobClient:     TIME_IN_SYNC_MS=186

14/08/14 01:25:05 INFO bsp.BSPJobClient:     TOTAL_MESSAGES_SENT=135

14/08/14 01:25:05 INFO bsp.BSPJobClient:     TOTAL_MESSAGES_RECEIVED=135

14/08/14 01:25:05 INFO bsp.BSPJobClient:     TASK_OUTPUT_RECORDS=135

Tests run: 1, Failures: 0, Errors: 0, Skipped: 0, Time elapsed: 0.013 sec
Running org.apache.hama.zookeeper.TestZKTools
Tests run: 1, Failures: 0, Errors: 0, Skipped: 0, Time elapsed: 0.018 sec
Running org.apache.hama.bsp.TestZooKeeper
14/08/14 01:25:06 ERROR quorum.QuorumPeerConfig: Invalid configuration, only one server specified
(ignoring)

14/08/14 01:25:06 INFO server.ZooKeeperServerMain: Starting server

14/08/14 01:25:06 INFO server.ZooKeeperServer: Server environment:zookeeper.version=3.4.5-1392090,
built on 09/30/2012 17:52 GMT

14/08/14 01:25:06 INFO server.ZooKeeperServer: Server environment:host.name=pomona.apache.org

14/08/14 01:25:06 INFO server.ZooKeeperServer: Server environment:java.version=1.7.0_25

14/08/14 01:25:06 INFO server.ZooKeeperServer: Server environment:java.vendor=Oracle Corporation

14/08/14 01:25:06 INFO server.ZooKeeperServer: Server environment:java.home=/home/jenkins/tools/java/jdk1.7.0_25-32/jre

14/08/14 01:25:06 INFO server.ZooKeeperServer: Server environment:java.class.path=/tmp/surefirebooter6484936872790747334.jar

14/08/14 01:25:06 INFO server.ZooKeeperServer: Server environment:java.library.path=/usr/java/packages/lib/i386:/lib:/usr/lib

14/08/14 01:25:06 INFO server.ZooKeeperServer: Server environment:java.io.tmpdir=/tmp

14/08/14 01:25:06 INFO server.ZooKeeperServer: Server environment:java.compiler=<NA>

14/08/14 01:25:06 INFO server.ZooKeeperServer: Server environment:os.name=Linux

14/08/14 01:25:06 INFO server.ZooKeeperServer: Server environment:os.arch=i386

14/08/14 01:25:06 INFO server.ZooKeeperServer: Server environment:os.version=3.13.0-24-generic

14/08/14 01:25:06 INFO server.ZooKeeperServer: Server environment:user.name=jenkins

14/08/14 01:25:06 INFO server.ZooKeeperServer: Server environment:user.home=/home/jenkins

14/08/14 01:25:06 INFO server.ZooKeeperServer: Server environment:user.dir=/tmp

14/08/14 01:25:06 INFO server.ZooKeeperServer: tickTime set to 3000

14/08/14 01:25:06 INFO server.ZooKeeperServer: minSessionTimeout set to -1

14/08/14 01:25:06 INFO server.ZooKeeperServer: maxSessionTimeout set to 1200000

14/08/14 01:25:06 INFO server.NIOServerCnxnFactory: binding to port 0.0.0.0/0.0.0.0:20000

14/08/14 01:25:06 INFO persistence.FileSnap: Reading snapshot /tmp/hama-testzookeeper/version-2/snapshot.0

14/08/14 01:25:06 INFO persistence.FileTxnSnapLog: Snapshotting: 0x6 to /tmp/hama-testzookeeper/version-2/snapshot.6

14/08/14 01:25:16 INFO zookeeper.ZooKeeper: Client environment:zookeeper.version=3.4.5-1392090,
built on 09/30/2012 17:52 GMT

14/08/14 01:25:16 INFO zookeeper.ZooKeeper: Client environment:host.name=pomona.apache.org

14/08/14 01:25:16 INFO zookeeper.ZooKeeper: Client environment:java.version=1.7.0_25

14/08/14 01:25:16 INFO zookeeper.ZooKeeper: Client environment:java.vendor=Oracle Corporation

14/08/14 01:25:16 INFO zookeeper.ZooKeeper: Client environment:java.home=/home/jenkins/tools/java/jdk1.7.0_25-32/jre

14/08/14 01:25:16 INFO zookeeper.ZooKeeper: Client environment:java.class.path=/tmp/surefirebooter6484936872790747334.jar

14/08/14 01:25:16 INFO zookeeper.ZooKeeper: Client environment:java.library.path=/usr/java/packages/lib/i386:/lib:/usr/lib

14/08/14 01:25:16 INFO zookeeper.ZooKeeper: Client environment:java.io.tmpdir=/tmp

14/08/14 01:25:16 INFO zookeeper.ZooKeeper: Client environment:java.compiler=<NA>

14/08/14 01:25:16 INFO zookeeper.ZooKeeper: Client environment:os.name=Linux

14/08/14 01:25:16 INFO zookeeper.ZooKeeper: Client environment:os.arch=i386

14/08/14 01:25:16 INFO zookeeper.ZooKeeper: Client environment:os.version=3.13.0-24-generic

14/08/14 01:25:16 INFO zookeeper.ZooKeeper: Client environment:user.name=jenkins

14/08/14 01:25:16 INFO zookeeper.ZooKeeper: Client environment:user.home=/home/jenkins

14/08/14 01:25:16 INFO zookeeper.ZooKeeper: Client environment:user.dir=/tmp

14/08/14 01:25:16 INFO zookeeper.ZooKeeper: Initiating client connection, connectString=localhost:20000
sessionTimeout=1200000 watcher=org.apache.hama.bsp.sync.ZKSyncBSPMasterClient@d7cb51

14/08/14 01:25:16 INFO sync.ZKSyncBSPMasterClient: Initialized ZK false

14/08/14 01:25:16 INFO sync.ZKSyncClient: Initializing ZK Sync Client

14/08/14 01:25:16 INFO zookeeper.ClientCnxn: Opening socket connection to server localhost/0:0:0:0:0:0:0:1:20000.
Will not attempt to authenticate using SASL (unknown error)

14/08/14 01:25:16 INFO zookeeper.ClientCnxn: Socket connection established to localhost/0:0:0:0:0:0:0:1:20000,
initiating session

14/08/14 01:25:16 INFO server.NIOServerCnxnFactory: Accepted socket connection from /0:0:0:0:0:0:0:1:52394

14/08/14 01:25:16 INFO server.ZooKeeperServer: Client attempting to establish new session
at /0:0:0:0:0:0:0:1:52394

14/08/14 01:25:16 INFO persistence.FileTxnLog: Creating new log file: log.7

14/08/14 01:25:16 INFO server.ZooKeeperServer: Established session 0x147d21e4d010000 with
negotiated timeout 1200000 for client /0:0:0:0:0:0:0:1:52394

14/08/14 01:25:16 INFO zookeeper.ClientCnxn: Session establishment complete on server localhost/0:0:0:0:0:0:0:1:20000,
sessionid = 0x147d21e4d010000, negotiated timeout = 1200000

14/08/14 01:25:17 INFO mortbay.log: Logging to org.slf4j.impl.Log4jLoggerAdapter(org.mortbay.log)
via org.mortbay.log.Slf4jLog

14/08/14 01:25:17 INFO mortbay.log: Created master and client sync clients

14/08/14 01:25:17 INFO mortbay.log: BSP root exists

14/08/14 01:25:17 INFO zookeeper.ZooKeeper: Initiating client connection, connectString=localhost:20000
sessionTimeout=1200000 watcher=org.apache.hama.bsp.sync.ZooKeeperSyncClientImpl@158f08f

14/08/14 01:25:17 INFO zookeeper.ClientCnxn: Opening socket connection to server localhost/127.0.0.1:20000.
Will not attempt to authenticate using SASL (unknown error)

14/08/14 01:25:17 INFO sync.ZKSyncClient: Initializing ZK Sync Client

14/08/14 01:25:17 INFO sync.ZooKeeperSyncClientImpl: Start connecting to Zookeeper! At /0.0.0.0:21815

14/08/14 01:25:17 INFO server.NIOServerCnxnFactory: Accepted socket connection from /127.0.0.1:38304

14/08/14 01:25:17 INFO zookeeper.ClientCnxn: Socket connection established to localhost/127.0.0.1:20000,
initiating session

14/08/14 01:25:17 INFO server.ZooKeeperServer: Client attempting to establish new session
at /127.0.0.1:38304

14/08/14 01:25:17 INFO server.ZooKeeperServer: Established session 0x147d21e4d010001 with
negotiated timeout 1200000 for client /127.0.0.1:38304

14/08/14 01:25:17 INFO zookeeper.ClientCnxn: Session establishment complete on server localhost/127.0.0.1:20000,
sessionid = 0x147d21e4d010001, negotiated timeout = 1200000

14/08/14 01:25:17 INFO sync.ZKSyncClient: Writing data /bsp/job_test1_0001/info/level2

14/08/14 01:25:17 INFO mortbay.log: Found child count = 2

14/08/14 01:25:17 INFO mortbay.log: Passed the child count test

14/08/14 01:25:17 INFO mortbay.log: Found child count = 2

14/08/14 01:25:17 INFO mortbay.log:  Peer name 2

14/08/14 01:25:17 INFO mortbay.log:  Peer name 1

14/08/14 01:25:17 INFO mortbay.log: Passed the child key set test

14/08/14 01:25:17 INFO mortbay.log: /bsp/job_test1_0001

14/08/14 01:25:17 INFO mortbay.log: Passed the key presence test

14/08/14 01:25:17 INFO sync.ZKSyncClient: Writing data /bsp/job_test1_0001/info/level3

14/08/14 01:25:17 INFO mortbay.log: Passed array writable test

14/08/14 01:25:17 INFO server.NIOServerCnxn: Closed socket connection for client /127.0.0.1:38304
which had sessionid 0x147d21e4d010001

14/08/14 01:25:17 INFO zookeeper.ClientCnxn: Unable to read additional data from server sessionid
0x147d21e4d010001, likely server has closed socket, closing socket connection and attempting
reconnect

14/08/14 01:25:17 INFO server.NIOServerCnxn: Closed socket connection for client /0:0:0:0:0:0:0:1:52394
which had sessionid 0x147d21e4d010000

14/08/14 01:25:17 INFO zookeeper.ClientCnxn: Unable to read additional data from server sessionid
0x147d21e4d010000, likely server has closed socket, closing socket connection and attempting
reconnect

14/08/14 01:25:17 INFO server.NIOServerCnxnFactory: NIOServerCnxn factory exited run method

14/08/14 01:25:17 INFO server.ZooKeeperServer: shutting down

14/08/14 01:25:17 INFO server.SessionTrackerImpl: Shutting down

14/08/14 01:25:17 INFO server.PrepRequestProcessor: Shutting down

14/08/14 01:25:17 INFO server.PrepRequestProcessor: PrepRequestProcessor exited loop!

14/08/14 01:25:17 INFO server.SyncRequestProcessor: Shutting down

14/08/14 01:25:17 INFO server.SyncRequestProcessor: SyncRequestProcessor exited!

14/08/14 01:25:17 INFO server.FinalRequestProcessor: shutdown of request processor complete

Tests run: 1, Failures: 0, Errors: 0, Skipped: 0, Time elapsed: 0.02 sec

Results :

Failed tests: 

Tests run: 55, Failures: 1, Errors: 0, Skipped: 0

[INFO] ------------------------------------------------------------------------
[INFO] Reactor Summary:
[INFO] 
[INFO] Apache Hama parent POM ............................ SUCCESS [45.454s]
[INFO] pipes ............................................. SUCCESS [30.068s]
[INFO] commons ........................................... SUCCESS [14.718s]
[INFO] core .............................................. FAILURE [3:23.778s]
[INFO] graph ............................................. SKIPPED
[INFO] machine learning .................................. SKIPPED
[INFO] examples .......................................... SKIPPED
[INFO] mesos ............................................. SKIPPED
[INFO] hama-dist ......................................... SKIPPED
[INFO] ------------------------------------------------------------------------
[INFO] BUILD FAILURE
[INFO] ------------------------------------------------------------------------
[INFO] Total time: 4:57.299s
[INFO] Finished at: Thu Aug 14 01:25:17 UTC 2014
[INFO] Final Memory: 57M/753M
[INFO] ------------------------------------------------------------------------
[ERROR] Failed to execute goal org.apache.maven.plugins:maven-surefire-plugin:2.6:test (default-test)
on project hama-core: There are test failures.
[ERROR] 
[ERROR] Please refer to <https://builds.apache.org/job/Hama-Nightly-for-Hadoop-1.x/ws/trunk/core/target/surefire-reports>
for the individual test results.
[ERROR] -> [Help 1]
[ERROR] 
[ERROR] To see the full stack trace of the errors, re-run Maven with the -e switch.
[ERROR] Re-run Maven using the -X switch to enable full debug logging.
[ERROR] 
[ERROR] For more information about the errors and possible solutions, please read the following
articles:
[ERROR] [Help 1] http://cwiki.apache.org/confluence/display/MAVEN/MojoFailureException
[ERROR] 
[ERROR] After correcting the problems, you can resume the build with the command
[ERROR]   mvn <goals> -rf :hama-core
Build step 'Invoke top-level Maven targets' marked build as failure
Archiving artifacts
Sending artifact delta relative to Hama-Nightly-for-Hadoop-1.x #1335
Archived 68 artifacts
Archive block size is 32768
Received 0 blocks and 224504 bytes
Compression is 0.0%
Took 3.2 sec
Recording test results

Mime
View raw message