hama-dev mailing list archives

Site index · List index
Message view « Date » · « Thread »
Top « Date » · « Thread »
From Apache Jenkins Server <jenk...@builds.apache.org>
Subject Build failed in Jenkins: Hama-Nightly-for-Hadoop-2.x #326
Date Fri, 08 Aug 2014 02:04:55 GMT
See <https://builds.apache.org/job/Hama-Nightly-for-Hadoop-2.x/326/>

------------------------------------------
[...truncated 104553 lines...]
[7.078279787575417, -4.367467991903288, 5.392573118458076, 4.751092332714601, 2.9213451436250497,
-0.9963210944084716, -0.6421222134455117]	4.136204544458424
[7.070590165967807, -4.394674703108866, 5.383193849479623, 4.738333790121049, 2.900896989537819,
-1.0204589152235353, -0.6739496088942645]	3.9320992443258813
[7.063167338947803, -4.419480340330619, 5.374348153444877, 4.72664238634335, 2.881782773619096,
-1.0429960293855516, -0.7039094777967867]	3.746724152620719
[7.0560842347812, -4.441228589854085, 5.366181878052325, 4.716309814532597, 2.864367120496723,
-1.0634948990816013, -0.7314913386809223]	3.5882736744855825
[7.0560842347812, -4.441228589854085, 5.366181878052325, 4.716309814532597, 2.864367120496723,
-1.0634948990816013, -0.7314913386809223]	3.458803849984058

Job Finished in 6.528 seconds
Tests run: 1, Failures: 0, Errors: 0, Skipped: 0, Time elapsed: 0.021 sec
Running org.apache.hama.examples.BipartiteMatchingTest
14/08/08 02:04:09 WARN util.NativeCodeLoader: Unable to load native-hadoop library for your
platform... using builtin-java classes where applicable

14/08/08 02:04:09 INFO bsp.FileInputFormat: Total input paths to process : 1

14/08/08 02:04:10 WARN snappy.LoadSnappy: Snappy native library not loaded

14/08/08 02:04:10 INFO bsp.FileInputFormat: Total input paths to process : 1

14/08/08 02:04:10 WARN bsp.BSPJobClient: No job jar file set.  User classes may not be found.
See BSPJob#setJar(String) or check Your jar file.

14/08/08 02:04:10 INFO bsp.BSPJobClient: Running job: job_localrunner_0001

14/08/08 02:04:10 INFO bsp.LocalBSPRunner: Setting up a new barrier for 1 tasks!

14/08/08 02:04:13 INFO bsp.BSPJobClient: Current supersteps number: 1

14/08/08 02:04:13 INFO bsp.BSPJobClient: The total number of supersteps: 1

14/08/08 02:04:13 INFO bsp.BSPJobClient: Counters: 6

14/08/08 02:04:13 INFO bsp.BSPJobClient:   org.apache.hama.bsp.JobInProgress$JobCounter

14/08/08 02:04:13 INFO bsp.BSPJobClient:     SUPERSTEPS=1

14/08/08 02:04:13 INFO bsp.BSPJobClient:     LAUNCHED_TASKS=1

14/08/08 02:04:13 INFO bsp.BSPJobClient:   org.apache.hama.bsp.BSPPeerImpl$PeerCounter

14/08/08 02:04:13 INFO bsp.BSPJobClient:     SUPERSTEP_SUM=2

14/08/08 02:04:13 INFO bsp.BSPJobClient:     IO_BYTES_READ=28

14/08/08 02:04:13 INFO bsp.BSPJobClient:     TIME_IN_SYNC_MS=0

14/08/08 02:04:13 INFO bsp.BSPJobClient:     TASK_INPUT_RECORDS=4

14/08/08 02:04:13 INFO bsp.FileInputFormat: Total input paths to process : 2

14/08/08 02:04:13 WARN bsp.BSPJobClient: No job jar file set.  User classes may not be found.
See BSPJob#setJar(String) or check Your jar file.

14/08/08 02:04:13 INFO bsp.LocalBSPRunner: Setting up a new barrier for 2 tasks!

14/08/08 02:04:13 INFO bsp.BSPJobClient: Running job: job_localrunner_0001

14/08/08 02:04:13 INFO graph.GraphJobRunner: 2 vertices are loaded into local:1

14/08/08 02:04:13 INFO graph.GraphJobRunner: 2 vertices are loaded into local:0

14/08/08 02:04:16 INFO bsp.BSPJobClient: Current supersteps number: 30

14/08/08 02:04:16 INFO bsp.BSPJobClient: The total number of supersteps: 30

14/08/08 02:04:16 INFO bsp.BSPJobClient: Counters: 12

14/08/08 02:04:16 INFO bsp.BSPJobClient:   org.apache.hama.graph.GraphJobRunner$GraphJobCounter

14/08/08 02:04:16 INFO bsp.BSPJobClient:     ITERATIONS=30

14/08/08 02:04:16 INFO bsp.BSPJobClient:     INPUT_VERTICES=4

14/08/08 02:04:16 INFO bsp.BSPJobClient:   org.apache.hama.bsp.JobInProgress$JobCounter

14/08/08 02:04:16 INFO bsp.BSPJobClient:     SUPERSTEPS=30

14/08/08 02:04:16 INFO bsp.BSPJobClient:     LAUNCHED_TASKS=2

14/08/08 02:04:16 INFO bsp.BSPJobClient:   org.apache.hama.bsp.BSPPeerImpl$PeerCounter

14/08/08 02:04:16 INFO bsp.BSPJobClient:     SUPERSTEP_SUM=62

14/08/08 02:04:16 INFO bsp.BSPJobClient:     MESSAGE_BYTES_TRANSFERED=3605

14/08/08 02:04:16 INFO bsp.BSPJobClient:     IO_BYTES_READ=92

14/08/08 02:04:16 INFO bsp.BSPJobClient:     TIME_IN_SYNC_MS=176

14/08/08 02:04:16 INFO bsp.BSPJobClient:     TOTAL_MESSAGES_SENT=139

14/08/08 02:04:16 INFO bsp.BSPJobClient:     TASK_INPUT_RECORDS=4

14/08/08 02:04:16 INFO bsp.BSPJobClient:     TOTAL_MESSAGES_RECEIVED=135

14/08/08 02:04:16 INFO bsp.BSPJobClient:     TASK_OUTPUT_RECORDS=4

Job Finished in 7.002 seconds
A -> U L expvalue = B L
Tests run: 1, Failures: 1, Errors: 0, Skipped: 0, Time elapsed: 0.098 sec <<< FAILURE!
Running org.apache.hama.examples.SemiClusterMatchingTest
14/08/08 02:04:19 WARN util.NativeCodeLoader: Unable to load native-hadoop library for your
platform... using builtin-java classes where applicable

14/08/08 02:04:19 INFO bsp.FileInputFormat: Total input paths to process : 1

14/08/08 02:04:19 WARN snappy.LoadSnappy: Snappy native library not loaded

14/08/08 02:04:19 INFO bsp.FileInputFormat: Total input paths to process : 1

14/08/08 02:04:19 WARN bsp.BSPJobClient: No job jar file set.  User classes may not be found.
See BSPJob#setJar(String) or check Your jar file.

14/08/08 02:04:19 INFO bsp.BSPJobClient: Running job: job_localrunner_0001

14/08/08 02:04:19 INFO bsp.LocalBSPRunner: Setting up a new barrier for 1 tasks!

14/08/08 02:04:22 INFO bsp.BSPJobClient: Current supersteps number: 1

14/08/08 02:04:22 INFO bsp.BSPJobClient: The total number of supersteps: 1

14/08/08 02:04:22 INFO bsp.BSPJobClient: Counters: 6

14/08/08 02:04:22 INFO bsp.BSPJobClient:   org.apache.hama.bsp.JobInProgress$JobCounter

14/08/08 02:04:22 INFO bsp.BSPJobClient:     SUPERSTEPS=1

14/08/08 02:04:22 INFO bsp.BSPJobClient:     LAUNCHED_TASKS=1

14/08/08 02:04:22 INFO bsp.BSPJobClient:   org.apache.hama.bsp.BSPPeerImpl$PeerCounter

14/08/08 02:04:22 INFO bsp.BSPJobClient:     SUPERSTEP_SUM=2

14/08/08 02:04:22 INFO bsp.BSPJobClient:     IO_BYTES_READ=7189

14/08/08 02:04:22 INFO bsp.BSPJobClient:     TIME_IN_SYNC_MS=0

14/08/08 02:04:22 INFO bsp.BSPJobClient:     TASK_INPUT_RECORDS=100

14/08/08 02:04:22 INFO bsp.FileInputFormat: Total input paths to process : 3

14/08/08 02:04:22 WARN bsp.BSPJobClient: No job jar file set.  User classes may not be found.
See BSPJob#setJar(String) or check Your jar file.

14/08/08 02:04:23 INFO bsp.LocalBSPRunner: Setting up a new barrier for 3 tasks!

14/08/08 02:04:23 INFO bsp.BSPJobClient: Running job: job_localrunner_0001

14/08/08 02:04:23 INFO graph.GraphJobRunner: 33 vertices are loaded into local:2

14/08/08 02:04:23 INFO graph.GraphJobRunner: 34 vertices are loaded into local:1

14/08/08 02:04:23 INFO graph.GraphJobRunner: 33 vertices are loaded into local:0

14/08/08 02:04:26 INFO bsp.BSPJobClient: Current supersteps number: 2

14/08/08 02:04:29 INFO bsp.BSPJobClient: Current supersteps number: 6

14/08/08 02:04:32 INFO bsp.BSPJobClient: Current supersteps number: 11

14/08/08 02:04:35 INFO bsp.BSPJobClient: Current supersteps number: 15

14/08/08 02:04:35 INFO bsp.BSPJobClient: The total number of supersteps: 15

14/08/08 02:04:35 INFO bsp.BSPJobClient: Counters: 12

14/08/08 02:04:35 INFO bsp.BSPJobClient:   org.apache.hama.graph.GraphJobRunner$GraphJobCounter

14/08/08 02:04:35 INFO bsp.BSPJobClient:     ITERATIONS=15

14/08/08 02:04:35 INFO bsp.BSPJobClient:     INPUT_VERTICES=100

14/08/08 02:04:35 INFO bsp.BSPJobClient:   org.apache.hama.bsp.JobInProgress$JobCounter

14/08/08 02:04:35 INFO bsp.BSPJobClient:     SUPERSTEPS=15

14/08/08 02:04:35 INFO bsp.BSPJobClient:     LAUNCHED_TASKS=3

14/08/08 02:04:35 INFO bsp.BSPJobClient:   org.apache.hama.bsp.BSPPeerImpl$PeerCounter

14/08/08 02:04:35 INFO bsp.BSPJobClient:     SUPERSTEP_SUM=48

14/08/08 02:04:35 INFO bsp.BSPJobClient:     MESSAGE_BYTES_TRANSFERED=16947823

14/08/08 02:04:35 INFO bsp.BSPJobClient:     IO_BYTES_READ=8850

14/08/08 02:04:35 INFO bsp.BSPJobClient:     TIME_IN_SYNC_MS=1878

14/08/08 02:04:35 INFO bsp.BSPJobClient:     TOTAL_MESSAGES_SENT=166202

14/08/08 02:04:35 INFO bsp.BSPJobClient:     TASK_INPUT_RECORDS=100

14/08/08 02:04:35 INFO bsp.BSPJobClient:     TOTAL_MESSAGES_RECEIVED=155196

14/08/08 02:04:35 INFO bsp.BSPJobClient:     TASK_OUTPUT_RECORDS=100

Job Finished in 16.329 seconds
C1691 = [41, 44, 47, 42, 45, 48, 40, 43, 46, 49]
C1784 = [71, 74, 77, 72, 75, 78, 70, 73, 76, 79]
C1598 = [11, 14, 17, 12, 15, 18, 10, 13, 16, 19]
C1815 = [80, 83, 86, 89, 81, 84, 87, 82, 85, 88]
C1722 = [50, 53, 56, 59, 51, 54, 57, 52, 55, 58]
C79 = [2, 5, 8, 0, 3, 6, 9, 1, 4, 7]
C1753 = [62, 65, 68, 60, 63, 66, 69, 61, 64, 67]
C1846 = [92, 95, 98, 90, 93, 96, 99, 91, 94, 97]
C1629 = [20, 23, 26, 29, 21, 24, 27, 22, 25, 28]
C1660 = [32, 35, 38, 30, 33, 36, 39, 31, 34, 37]
Tests run: 1, Failures: 0, Errors: 0, Skipped: 0, Time elapsed: 0.103 sec

Results :

Failed tests: 

Tests run: 20, Failures: 1, Errors: 0, Skipped: 0

[INFO] ------------------------------------------------------------------------
[INFO] Reactor Summary:
[INFO] 
[INFO] Apache Hama parent POM ............................ SUCCESS [14.156s]
[INFO] pipes ............................................. SUCCESS [24.252s]
[INFO] commons ........................................... SUCCESS [16.854s]
[INFO] core .............................................. SUCCESS [4:31.429s]
[INFO] graph ............................................. SUCCESS [46.744s]
[INFO] machine learning .................................. SUCCESS [3:23.320s]
[INFO] examples .......................................... FAILURE [2:14.398s]
[INFO] mesos ............................................. SKIPPED
[INFO] hama-dist ......................................... SKIPPED
[INFO] ------------------------------------------------------------------------
[INFO] BUILD FAILURE
[INFO] ------------------------------------------------------------------------
[INFO] Total time: 11:52.916s
[INFO] Finished at: Fri Aug 08 02:04:35 UTC 2014
[INFO] Final Memory: 131M/980M
[INFO] ------------------------------------------------------------------------
[ERROR] Failed to execute goal org.apache.maven.plugins:maven-surefire-plugin:2.6:test (default-test)
on project hama-examples: There are test failures.
[ERROR] 
[ERROR] Please refer to /x1/jenkins/jenkins-slave/workspace/Hama-Nightly-for-Hadoop-2.x/trunk/examples/target/surefire-reports
for the individual test results.
[ERROR] -> [Help 1]
[ERROR] 
[ERROR] To see the full stack trace of the errors, re-run Maven with the -e switch.
[ERROR] Re-run Maven using the -X switch to enable full debug logging.
[ERROR] 
[ERROR] For more information about the errors and possible solutions, please read the following
articles:
[ERROR] [Help 1] http://cwiki.apache.org/confluence/display/MAVEN/MojoFailureException
[ERROR] 
[ERROR] After correcting the problems, you can resume the build with the command
[ERROR]   mvn <goals> -rf :hama-examples
Build step 'Invoke top-level Maven targets' marked build as failure
Archiving artifacts
Sending artifact delta relative to Hama-Nightly-for-Hadoop-2.x #325
Archived 141 artifacts
Archive block size is 32768
Received 1531 blocks and 432152 bytes
Compression is 99.1%
Took 14 sec
Recording test results

Mime
View raw message