hama-dev mailing list archives

Site index · List index
Message view « Date » · « Thread »
Top « Date » · « Thread »
From Apache Jenkins Server <jenk...@builds.apache.org>
Subject Build failed in Jenkins: Hama-Nightly-for-Hadoop-1.x #1311
Date Sun, 20 Jul 2014 00:00:16 GMT
See <https://builds.apache.org/job/Hama-Nightly-for-Hadoop-1.x/1311/>

------------------------------------------
[...truncated 12690 lines...]
1271/1889 KB   
1275/1889 KB   
1279/1889 KB   
1280/1889 KB   
1281/1889 KB   
1285/1889 KB   
1289/1889 KB   
1293/1889 KB   
1297/1889 KB   
1301/1889 KB   
1305/1889 KB   
1309/1889 KB   
1313/1889 KB   
1317/1889 KB   
1321/1889 KB   
1325/1889 KB   
1329/1889 KB   
1333/1889 KB   
1337/1889 KB   
1341/1889 KB   
1345/1889 KB   
1349/1889 KB   
1353/1889 KB   
1357/1889 KB   
1361/1889 KB   
1365/1889 KB   
1369/1889 KB   
1373/1889 KB   
1377/1889 KB   
1381/1889 KB   
1385/1889 KB   
1389/1889 KB   
1393/1889 KB   
1397/1889 KB   
1401/1889 KB   
1405/1889 KB   
1409/1889 KB   
1413/1889 KB   
1417/1889 KB   
1421/1889 KB   
1425/1889 KB   
1429/1889 KB   
1433/1889 KB   
1437/1889 KB   
1441/1889 KB   
1445/1889 KB   
1449/1889 KB   
1453/1889 KB   
1457/1889 KB   
1461/1889 KB   
1465/1889 KB   
1469/1889 KB   
1473/1889 KB   
1477/1889 KB   
1481/1889 KB   
1485/1889 KB   
1489/1889 KB   
1493/1889 KB   
1495/1889 KB   
1496/1889 KB   
1500/1889 KB   
1504/1889 KB   
1508/1889 KB   
1512/1889 KB   
1516/1889 KB   
1520/1889 KB   
1524/1889 KB   
1528/1889 KB   
1532/1889 KB   
1536/1889 KB   
1540/1889 KB   
1544/1889 KB   
1548/1889 KB   
1552/1889 KB   
1556/1889 KB   
1560/1889 KB   
1564/1889 KB   
1568/1889 KB   
1572/1889 KB   
1576/1889 KB   
1580/1889 KB   
1584/1889 KB   
1588/1889 KB   
1592/1889 KB   
1596/1889 KB   
1600/1889 KB   
1604/1889 KB   
1608/1889 KB   
1612/1889 KB   
1616/1889 KB   
1620/1889 KB   
1624/1889 KB   
1628/1889 KB   
1632/1889 KB   
1636/1889 KB   
1640/1889 KB   
1644/1889 KB   
1648/1889 KB   
1652/1889 KB   
1656/1889 KB   
1660/1889 KB   
1664/1889 KB   
1668/1889 KB   
1672/1889 KB   
1676/1889 KB   
1680/1889 KB   
1684/1889 KB   
1688/1889 KB   
1692/1889 KB   
1696/1889 KB   
1700/1889 KB   
1704/1889 KB   
1708/1889 KB   
1711/1889 KB   
1713/1889 KB   
1717/1889 KB   
1721/1889 KB   
1725/1889 KB   
1729/1889 KB   
1733/1889 KB   
1737/1889 KB   
1741/1889 KB   
1745/1889 KB   
1749/1889 KB   
1753/1889 KB   
1757/1889 KB   
1761/1889 KB   
1765/1889 KB   
1769/1889 KB   
1773/1889 KB   
1777/1889 KB   
1781/1889 KB   
1785/1889 KB   
1789/1889 KB   
1793/1889 KB   
1797/1889 KB   
1801/1889 KB   
1805/1889 KB   
1809/1889 KB   
1813/1889 KB   
1817/1889 KB   
1821/1889 KB   
1825/1889 KB   
1829/1889 KB   
1833/1889 KB   
1837/1889 KB   
1841/1889 KB   
1845/1889 KB   
1849/1889 KB   
1853/1889 KB   
1857/1889 KB   
1861/1889 KB   
1865/1889 KB   
1869/1889 KB   
1873/1889 KB   
1877/1889 KB   
1881/1889 KB   
1885/1889 KB   
1889/1889 KB   
1889/1889 KB   
               
Downloaded: http://repo.maven.apache.org/maven2/org/apache/ant/ant/1.8.2/ant-1.8.2.jar (1889
KB at 4829.7 KB/sec)
[INFO] Executing tasks

main:
    [mkdir] Created dir: <https://builds.apache.org/job/Hama-Nightly-for-Hadoop-1.x/ws/trunk/c++/target/native>
     [exec] -- The C compiler identification is GNU 4.8.2
     [exec] -- The CXX compiler identification is GNU 4.8.2
     [exec] -- Check for working C compiler: /usr/bin/cc
     [exec] -- Check for working C compiler: /usr/bin/cc -- works
     [exec] -- Detecting C compiler ABI info
     [exec] -- Detecting C compiler ABI info - done
     [exec] -- Check for working CXX compiler: /usr/bin/c++
     [exec] -- Check for working CXX compiler: /usr/bin/c++ -- works
     [exec] -- Detecting CXX compiler ABI info
     [exec] -- Detecting CXX compiler ABI info - done
     [exec] JAVA_HOME=, JAVA_JVM_LIBRARY=/home/hudson/tools/java/latest1.7/jre/lib/i386/server/libjvm.so
     [exec] JAVA_INCLUDE_PATH=/home/hudson/tools/java/latest1.7/include, JAVA_INCLUDE_PATH2=/home/hudson/tools/java/latest1.7/include/linux
     [exec] Located all JNI components successfully.
     [exec] -- Configuring done
     [exec] -- Generating done
     [exec] -- Build files have been written to: <https://builds.apache.org/job/Hama-Nightly-for-Hadoop-1.x/ws/trunk/c++/target/native>
     [exec] /usr/bin/cmake -H<https://builds.apache.org/job/Hama-Nightly-for-Hadoop-1.x/ws/trunk/c++/src>
-B<https://builds.apache.org/job/Hama-Nightly-for-Hadoop-1.x/ws/trunk/c++/target/native>
--check-build-system CMakeFiles/Makefile.cmake 0
     [exec] /usr/bin/cmake -E cmake_progress_start <https://builds.apache.org/job/Hama-Nightly-for-Hadoop-1.x/ws/trunk/c++/target/native/CMakeFiles>
<https://builds.apache.org/job/Hama-Nightly-for-Hadoop-1.x/ws/trunk/c++/target/native/CMakeFiles/progress.marks>
     [exec] make -f CMakeFiles/Makefile2 all
     [exec] make[1]: Entering directory `<https://builds.apache.org/job/Hama-Nightly-for-Hadoop-1.x/ws/trunk/c++/target/native'>
     [exec] make -f CMakeFiles/DenseDoubleVector.dir/build.make CMakeFiles/DenseDoubleVector.dir/depend
     [exec] make[2]: Entering directory `<https://builds.apache.org/job/Hama-Nightly-for-Hadoop-1.x/ws/trunk/c++/target/native'>
     [exec] cd <https://builds.apache.org/job/Hama-Nightly-for-Hadoop-1.x/ws/trunk/c++/target/native>
&& /usr/bin/cmake -E cmake_depends "Unix Makefiles" <https://builds.apache.org/job/Hama-Nightly-for-Hadoop-1.x/ws/trunk/c++/src>
<https://builds.apache.org/job/Hama-Nightly-for-Hadoop-1.x/ws/trunk/c++/src> <https://builds.apache.org/job/Hama-Nightly-for-Hadoop-1.x/ws/trunk/c++/target/native>
<https://builds.apache.org/job/Hama-Nightly-for-Hadoop-1.x/ws/trunk/c++/target/native>
<https://builds.apache.org/job/Hama-Nightly-for-Hadoop-1.x/ws/trunk/c++/target/native/CMakeFiles/DenseDoubleVector.dir/DependInfo.cmake>
--color=
     [exec] Dependee "<https://builds.apache.org/job/Hama-Nightly-for-Hadoop-1.x/ws/trunk/c++/target/native/CMakeFiles/DenseDoubleVector.dir/DependInfo.cmake">
is newer than depender "<https://builds.apache.org/job/Hama-Nightly-for-Hadoop-1.x/ws/trunk/c++/target/native/CMakeFiles/DenseDoubleVector.dir/depend.internal".>
     [exec] Dependee "<https://builds.apache.org/job/Hama-Nightly-for-Hadoop-1.x/ws/trunk/c++/target/native/CMakeFiles/CMakeDirectoryInformation.cmake">
is newer than depender "<https://builds.apache.org/job/Hama-Nightly-for-Hadoop-1.x/ws/trunk/c++/target/native/CMakeFiles/DenseDoubleVector.dir/depend.internal".>
     [exec] Scanning dependencies of target DenseDoubleVector
     [exec] make[2]: Leaving directory `<https://builds.apache.org/job/Hama-Nightly-for-Hadoop-1.x/ws/trunk/c++/target/native'>
     [exec] make -f CMakeFiles/DenseDoubleVector.dir/build.make CMakeFiles/DenseDoubleVector.dir/build
     [exec] make[2]: Entering directory `<https://builds.apache.org/job/Hama-Nightly-for-Hadoop-1.x/ws/trunk/c++/target/native'>
     [exec] /usr/bin/cmake -E cmake_progress_report <https://builds.apache.org/job/Hama-Nightly-for-Hadoop-1.x/ws/trunk/c++/target/native/CMakeFiles>
1
     [exec] [ 14%] Building CXX object CMakeFiles/DenseDoubleVector.dir/main/native/examples/impl/DenseDoubleVector.cc.o
     [exec] /usr/bin/c++    -g -Wall -O2 -D_REENTRANT -D_GNU_SOURCE -D_LARGEFILE_SOURCE -D_FILE_OFFSET_BITS=64
-m32 -I<https://builds.apache.org/job/Hama-Nightly-for-Hadoop-1.x/ws/trunk/c++/src/main/native/utils/api>
-I<https://builds.apache.org/job/Hama-Nightly-for-Hadoop-1.x/ws/trunk/c++/src/main/native/pipes/api>
-I<https://builds.apache.org/job/Hama-Nightly-for-Hadoop-1.x/ws/trunk/c++/src>    -o
CMakeFiles/DenseDoubleVector.dir/main/native/examples/impl/DenseDoubleVector.cc.o -c <https://builds.apache.org/job/Hama-Nightly-for-Hadoop-1.x/ws/trunk/c++/src/main/native/examples/impl/DenseDoubleVector.cc>
     [exec] In file included from <https://builds.apache.org/job/Hama-Nightly-for-Hadoop-1.x/ws/trunk/c++/src/main/native/utils/api/hadoop/StringUtils.hh>:22:0,
     [exec]                  from <https://builds.apache.org/job/Hama-Nightly-for-Hadoop-1.x/ws/trunk/c++/src/main/native/examples/impl/DenseDoubleVector.cc>:19:
     [exec] /usr/include/c++/4.8/string:38:28: fatal error: bits/c++config.h: No such file
or directory
     [exec]  #include <bits/c++config.h>
     [exec]                             ^
     [exec] compilation terminated.
     [exec] make[2]: *** [CMakeFiles/DenseDoubleVector.dir/main/native/examples/impl/DenseDoubleVector.cc.o]
Error 1
     [exec] make[1]: *** [CMakeFiles/DenseDoubleVector.dir/all] Error 2
     [exec] make: *** [all] Error 2
     [exec] make[2]: Leaving directory `<https://builds.apache.org/job/Hama-Nightly-for-Hadoop-1.x/ws/trunk/c++/target/native'>
     [exec] make[1]: Leaving directory `<https://builds.apache.org/job/Hama-Nightly-for-Hadoop-1.x/ws/trunk/c++/target/native'>
[INFO] ------------------------------------------------------------------------
[INFO] Reactor Summary:
[INFO] 
[INFO] Apache Hama parent POM ............................ SUCCESS [36.452s]
[INFO] pipes ............................................. FAILURE [4.725s]
[INFO] commons ........................................... SKIPPED
[INFO] core .............................................. SKIPPED
[INFO] graph ............................................. SKIPPED
[INFO] machine learning .................................. SKIPPED
[INFO] examples .......................................... SKIPPED
[INFO] mesos ............................................. SKIPPED
[INFO] hama-dist ......................................... SKIPPED
[INFO] ------------------------------------------------------------------------
[INFO] BUILD FAILURE
[INFO] ------------------------------------------------------------------------
[INFO] Total time: 44.079s
[INFO] Finished at: Sat Jul 19 23:59:19 UTC 2014
[INFO] Final Memory: 19M/91M
[INFO] ------------------------------------------------------------------------
[ERROR] Failed to execute goal org.apache.maven.plugins:maven-antrun-plugin:1.7:run (make)
on project hama-pipes: An Ant BuildException has occured: exec returned: 2
[ERROR] around Ant part ...<exec dir="<https://builds.apache.org/job/Hama-Nightly-for-Hadoop-1.x/ws/trunk/c++/target/native">
executable="make" failonerror="true">... @ 18:146 in <https://builds.apache.org/job/Hama-Nightly-for-Hadoop-1.x/ws/trunk/c++/target/antrun/build-main.xml>
[ERROR] -> [Help 1]
[ERROR] 
[ERROR] To see the full stack trace of the errors, re-run Maven with the -e switch.
[ERROR] Re-run Maven using the -X switch to enable full debug logging.
[ERROR] 
[ERROR] For more information about the errors and possible solutions, please read the following
articles:
[ERROR] [Help 1] http://cwiki.apache.org/confluence/display/MAVEN/MojoExecutionException
[ERROR] 
[ERROR] After correcting the problems, you can resume the build with the command
[ERROR]   mvn <goals> -rf :hama-pipes
Build step 'Invoke top-level Maven targets' marked build as failure
Archiving artifacts
Sending artifact delta relative to Hama-Nightly-for-Hadoop-1.x #1303
Archived 1 artifacts
Archive block size is 32768
Received 0 blocks and 4550 bytes
Compression is 0.0%
Took 1 sec
Recording test results

Mime
View raw message