hama-dev mailing list archives

Site index · List index
Message view « Date » · « Thread »
Top « Date » · « Thread »
From Apache Jenkins Server <jenk...@builds.apache.org>
Subject Build failed in Jenkins: Hama-trunk #317
Date Fri, 18 Jul 2014 12:15:17 GMT
See <https://builds.apache.org/job/Hama-trunk/317/changes>

Changes:

[edwardyoon] Fix a bug of readFields() method.

------------------------------------------
[...truncated 12700 lines...]
1482/1889 KB   
1485/1889 KB   
1488/1889 KB   
1491/1889 KB   
1495/1889 KB   
1495/1889 KB   
1499/1889 KB   
1499/1889 KB   
1502/1889 KB   
1505/1889 KB   
1506/1889 KB   
1507/1889 KB   
1510/1889 KB   
1513/1889 KB   
1517/1889 KB   
1520/1889 KB   
1524/1889 KB   
1526/1889 KB   
1530/1889 KB   
1530/1889 KB   
1534/1889 KB   
1537/1889 KB   
1541/1889 KB   
1541/1889 KB   
1544/1889 KB   
1548/1889 KB   
1548/1889 KB   
1551/1889 KB   
1554/1889 KB   
1557/1889 KB   
1561/1889 KB   
1561/1889 KB   
1565/1889 KB   
1565/1889 KB   
1567/1889 KB   
1568/1889 KB   
1571/1889 KB   
1574/1889 KB   
1577/1889 KB   
1580/1889 KB   
1584/1889 KB   
1584/1889 KB   
1585/1889 KB   
1589/1889 KB   
1589/1889 KB   
1592/1889 KB   
1596/1889 KB   
1597/1889 KB   
1599/1889 KB   
1602/1889 KB   
1604/1889 KB   
1608/1889 KB   
1611/1889 KB   
1614/1889 KB   
1615/1889 KB   
1618/1889 KB   
1621/1889 KB   
1623/1889 KB   
1627/1889 KB   
1628/1889 KB   
1630/1889 KB   
1632/1889 KB   
1635/1889 KB   
1638/1889 KB   
1640/1889 KB   
1643/1889 KB   
1646/1889 KB   
1650/1889 KB   
1650/1889 KB   
1654/1889 KB   
1655/1889 KB   
1659/1889 KB   
1659/1889 KB   
1663/1889 KB   
1663/1889 KB   
1666/1889 KB   
1669/1889 KB   
1673/1889 KB   
1677/1889 KB   
1677/1889 KB   
1680/1889 KB   
1684/1889 KB   
1687/1889 KB   
1691/1889 KB   
1691/1889 KB   
1695/1889 KB   
1696/1889 KB   
1698/1889 KB   
1702/1889 KB   
1705/1889 KB   
1708/1889 KB   
1711/1889 KB   
1714/1889 KB   
1718/1889 KB   
1718/1889 KB   
1721/1889 KB   
1722/1889 KB   
1726/1889 KB   
1727/1889 KB   
1731/1889 KB   
1731/1889 KB   
1734/1889 KB   
1737/1889 KB   
1741/1889 KB   
1742/1889 KB   
1746/1889 KB   
1748/1889 KB   
1751/1889 KB   
1755/1889 KB   
1755/1889 KB   
1759/1889 KB   
1759/1889 KB   
1763/1889 KB   
1763/1889 KB   
1766/1889 KB   
1770/1889 KB   
1773/1889 KB   
1776/1889 KB   
1779/1889 KB   
1782/1889 KB   
1786/1889 KB   
1786/1889 KB   
1789/1889 KB   
1793/1889 KB   
1795/1889 KB   
1799/1889 KB   
1799/1889 KB   
1802/1889 KB   
1804/1889 KB   
1808/1889 KB   
1810/1889 KB   
1814/1889 KB   
1816/1889 KB   
1819/1889 KB   
1823/1889 KB   
1823/1889 KB   
1827/1889 KB   
1827/1889 KB   
1831/1889 KB   
1831/1889 KB   
1834/1889 KB   
1838/1889 KB   
1841/1889 KB   
1844/1889 KB   
1847/1889 KB   
1850/1889 KB   
1854/1889 KB   
1854/1889 KB   
1857/1889 KB   
1861/1889 KB   
1862/1889 KB   
1865/1889 KB   
1867/1889 KB   
1869/1889 KB   
1873/1889 KB   
1877/1889 KB   
1881/1889 KB   
1885/1889 KB   
1889/1889 KB   
               
Downloaded: http://repo.maven.apache.org/maven2/org/apache/ant/ant/1.8.2/ant-1.8.2.jar (1889
KB at 1996.2 KB/sec)
[INFO] Executing tasks

main:
    [mkdir] Created dir: <https://builds.apache.org/job/Hama-trunk/ws/trunk/c++/target/native>
     [exec] -- The C compiler identification is GNU 4.8.2
     [exec] -- The CXX compiler identification is GNU 4.8.2
     [exec] -- Check for working C compiler: /usr/bin/cc
     [exec] -- Check for working C compiler: /usr/bin/cc -- works
     [exec] -- Detecting C compiler ABI info
     [exec] -- Detecting C compiler ABI info - done
     [exec] -- Check for working CXX compiler: /usr/bin/c++
     [exec] -- Check for working CXX compiler: /usr/bin/c++ -- works
     [exec] -- Detecting CXX compiler ABI info
     [exec] JAVA_HOME=, JAVA_JVM_LIBRARY=/home/hudson/tools/java/latest1.7/jre/lib/i386/server/libjvm.so
     [exec] JAVA_INCLUDE_PATH=/home/hudson/tools/java/latest1.7/include, JAVA_INCLUDE_PATH2=/home/hudson/tools/java/latest1.7/include/linux
     [exec] Located all JNI components successfully.
     [exec] -- Detecting CXX compiler ABI info - done
     [exec] -- Configuring done
     [exec] -- Generating done
     [exec] -- Build files have been written to: <https://builds.apache.org/job/Hama-trunk/ws/trunk/c++/target/native>
     [exec] /usr/bin/cmake -H<https://builds.apache.org/job/Hama-trunk/ws/trunk/c++/src>
-B<https://builds.apache.org/job/Hama-trunk/ws/trunk/c++/target/native> --check-build-system
CMakeFiles/Makefile.cmake 0
     [exec] /usr/bin/cmake -E cmake_progress_start <https://builds.apache.org/job/Hama-trunk/ws/trunk/c++/target/native/CMakeFiles>
<https://builds.apache.org/job/Hama-trunk/ws/trunk/c++/target/native/CMakeFiles/progress.marks>
     [exec] make -f CMakeFiles/Makefile2 all
     [exec] make[1]: Entering directory `/home/jenkins/jenkins-slIn file included from <https://builds.apache.org/job/Hama-trunk/ws/trunk/c++/src/main/native/utils/api/hadoop/StringUtils.hh>:22:0,
     [exec]                  from <https://builds.apache.org/job/Hama-trunk/ws/trunk/c++/src/main/native/examples/impl/DenseDoubleVector.cc>:19:
     [exec] /usr/include/c++/4.8/string:38:28: fatal error: bits/c++config.h: No such file
or directory
     [exec]  #include <bits/c++config.h>
     [exec]                             ^
     [exec] compilation terminated.
     [exec] make[2]: *** [CMakeFiles/DenseDoubleVector.dir/main/native/examples/impl/DenseDoubleVector.cc.o]
Error 1
     [exec] make[1]: *** [CMakeFiles/DenseDoubleVector.dir/all] Error 2
     [exec] make: *** [all] Error 2
     [exec] ave/workspace/Hama-trunk/trunk/c++/target/native'
     [exec] make -f CMakeFiles/DenseDoubleVector.dir/build.make CMakeFiles/DenseDoubleVector.dir/depend
     [exec] make[2]: Entering directory `<https://builds.apache.org/job/Hama-trunk/ws/trunk/c++/target/native'>
     [exec] cd <https://builds.apache.org/job/Hama-trunk/ws/trunk/c++/target/native>
&& /usr/bin/cmake -E cmake_depends "Unix Makefiles" <https://builds.apache.org/job/Hama-trunk/ws/trunk/c++/src>
<https://builds.apache.org/job/Hama-trunk/ws/trunk/c++/src> /home/jenkins
     [exec] /jenkins-slave/workspace/Hama-trunk/trunk/c++/target/native <https://builds.apache.org/job/Hama-trunk/ws/trunk/c++/target/native>
<https://builds.apache.org/job/Hama-trunk/ws/trunk/c++/target/native/CMakeFiles/DenseDoubleVector.dir/DependInfo.cmake>
--color=
     [exec] Dependee "<https://builds.apache.org/job/Hama-trunk/ws/trunk/c++/target/native/CMakeFiles/DenseDoubleVector.dir/DependInfo.cmake">
is newer than depender "<https://builds.apache.org/job/Hama-trunk/ws/trunk/c++/target/native/CMakeFiles/DenseDoubleVector.dir/depend.internal".>
     [exec] Dependee "<https://builds.apache.org/job/Hama-trunk/ws/trunk/c++/target/native/CMakeFiles/CMakeDirectoryInformation.cmake">
is newer than depender "<https://builds.apache.org/job/Hama-trunk/ws/trunk/c++/target/native/CMakeFiles/DenseDoubleVector.dir/depend.internal".>
     [exec] Scanning dependencies of target DenseDoubleVector
     [exec] make[2]: Leaving directory `<https://builds.apache.org/job/Hama-trunk/ws/trunk/c++/target/native'>
     [exec] make -f CMakeFiles/DenseDoubleVector.dir/build.make CMakeFiles/DenseDoubleVector.dir/build
     [exec] make[2]: Entering directory `<https://builds.apache.org/job/Hama-trunk/ws/trunk/c++/target/native'>
     [exec] /usr/bin/cmake -E cmake_progress_report <https://builds.apache.org/job/Hama-trunk/ws/trunk/c++/target/native/CMakeFiles>
1
     [exec] [ 14%] Building CXX object CMakeFiles/DenseDoubleVector.dir/main/native/examples/impl/DenseDoubleVector.cc.o
     [exec] /usr/bin/c++    -g -Wall -O2 -D_REENTRANT -D_GNU_SOURCE -D_LARGEFILE_SOURCE -D_FILE_OFFSET_BITS=64
-m32 -I<https://builds.apache.org/job/Hama-trunk/ws/trunk/c++/src/main/native/utils/api>
-I<https://builds.apache.org/job/Hama-trunk/ws/trunk/c++/src/main/native/pipes/api>
-I<https://builds.apache.org/job/Hama-trunk/ws/trunk/c++/src>    -o CMakeFiles/DenseDoubleVector.dir/main/native/examples/impl/DenseDoubleVector.cc.o
-c <https://builds.apache.org/job/Hama-trunk/ws/trunk/c++/src/main/native/examples/impl/DenseDoubleVector.cc>
     [exec] make[2]: Leaving directory `<https://builds.apache.org/job/Hama-trunk/ws/trunk/c++/target/native'>
     [exec] make[1]: Leaving directory `<https://builds.apache.org/job/Hama-trunk/ws/trunk/c++/target/native'>
[INFO] ------------------------------------------------------------------------
[INFO] Reactor Summary:
[INFO] 
[INFO] Apache Hama parent POM ............................ SUCCESS [33.585s]
[INFO] pipes ............................................. FAILURE [4.815s]
[INFO] commons ........................................... SKIPPED
[INFO] core .............................................. SKIPPED
[INFO] graph ............................................. SKIPPED
[INFO] machine learning .................................. SKIPPED
[INFO] examples .......................................... SKIPPED
[INFO] mesos ............................................. SKIPPED
[INFO] hama-dist ......................................... SKIPPED
[INFO] ------------------------------------------------------------------------
[INFO] BUILD FAILURE
[INFO] ------------------------------------------------------------------------
[INFO] Total time: 41.190s
[INFO] Finished at: Fri Jul 18 12:14:38 UTC 2014
[INFO] Final Memory: 19M/134M
[INFO] ------------------------------------------------------------------------
[ERROR] Failed to execute goal org.apache.maven.plugins:maven-antrun-plugin:1.7:run (make)
on project hama-pipes: An Ant BuildException has occured: exec returned: 2
[ERROR] around Ant part ...<exec dir="<https://builds.apache.org/job/Hama-trunk/ws/trunk/c++/target/native">
executable="make" failonerror="true">... @ 18:129 in <https://builds.apache.org/job/Hama-trunk/ws/trunk/c++/target/antrun/build-main.xml>
[ERROR] -> [Help 1]
[ERROR] 
[ERROR] To see the full stack trace of the errors, re-run Maven with the -e switch.
[ERROR] Re-run Maven using the -X switch to enable full debug logging.
[ERROR] 
[ERROR] For more information about the errors and possible solutions, please read the following
articles:
[ERROR] [Help 1] http://cwiki.apache.org/confluence/display/MAVEN/MojoExecutionException
[ERROR] 
[ERROR] After correcting the problems, you can resume the build with the command
[ERROR]   mvn <goals> -rf :hama-pipes
Build step 'Invoke top-level Maven targets' marked build as failure
Archiving artifacts
Sending artifact delta relative to Hama-trunk #313
Archived 1 artifacts
Archive block size is 32768
Received 0 blocks and 4550 bytes
Compression is 0.0%
Took 3.1 sec
Recording test results

Mime
View raw message