hama-dev mailing list archives

Site index · List index
Message view « Date » · « Thread »
Top « Date » · « Thread »
From Apache Jenkins Server <jenk...@builds.apache.org>
Subject Build failed in Jenkins: Hama-Nightly-for-Hadoop-1.x #1313
Date Mon, 21 Jul 2014 23:58:56 GMT
See <https://builds.apache.org/job/Hama-Nightly-for-Hadoop-1.x/1313/>

------------------------------------------
[...truncated 12582 lines...]
1268/1889 KB   
1272/1889 KB   
1276/1889 KB   
1280/1889 KB   
1284/1889 KB   
1288/1889 KB   
1292/1889 KB   
1296/1889 KB   
1300/1889 KB   
1304/1889 KB   
1308/1889 KB   
1312/1889 KB   
1316/1889 KB   
1320/1889 KB   
1324/1889 KB   
1328/1889 KB   
1332/1889 KB   
1336/1889 KB   
1340/1889 KB   
1344/1889 KB   
1348/1889 KB   
1349/1889 KB   
1351/1889 KB   
1353/1889 KB   
1357/1889 KB   
1361/1889 KB   
1365/1889 KB   
1369/1889 KB   
1373/1889 KB   
1377/1889 KB   
1381/1889 KB   
1385/1889 KB   
1389/1889 KB   
1393/1889 KB   
1397/1889 KB   
1401/1889 KB   
1405/1889 KB   
1409/1889 KB   
1413/1889 KB   
1417/1889 KB   
1421/1889 KB   
1425/1889 KB   
1429/1889 KB   
1433/1889 KB   
1437/1889 KB   
1441/1889 KB   
1445/1889 KB   
1449/1889 KB   
1453/1889 KB   
1457/1889 KB   
1461/1889 KB   
1465/1889 KB   
1469/1889 KB   
1473/1889 KB   
1477/1889 KB   
1481/1889 KB   
1485/1889 KB   
1489/1889 KB   
1493/1889 KB   
1497/1889 KB   
1501/1889 KB   
1505/1889 KB   
1509/1889 KB   
1513/1889 KB   
1517/1889 KB   
1521/1889 KB   
1525/1889 KB   
1529/1889 KB   
1533/1889 KB   
1537/1889 KB   
1541/1889 KB   
1545/1889 KB   
1549/1889 KB   
1553/1889 KB   
1557/1889 KB   
1561/1889 KB   
1565/1889 KB   
1569/1889 KB   
1573/1889 KB   
1577/1889 KB   
1581/1889 KB   
1585/1889 KB   
1589/1889 KB   
1593/1889 KB   
1597/1889 KB   
1601/1889 KB   
1605/1889 KB   
1609/1889 KB   
1613/1889 KB   
1617/1889 KB   
1619/1889 KB   
1621/1889 KB   
1625/1889 KB   
1626/1889 KB   
1630/1889 KB   
1634/1889 KB   
1638/1889 KB   
1642/1889 KB   
1646/1889 KB   
1650/1889 KB   
1654/1889 KB   
1658/1889 KB   
1662/1889 KB   
1666/1889 KB   
1670/1889 KB   
1674/1889 KB   
1678/1889 KB   
1682/1889 KB   
1686/1889 KB   
1690/1889 KB   
1694/1889 KB   
1698/1889 KB   
1702/1889 KB   
1706/1889 KB   
1710/1889 KB   
1714/1889 KB   
1718/1889 KB   
1722/1889 KB   
1726/1889 KB   
1730/1889 KB   
1734/1889 KB   
1738/1889 KB   
1742/1889 KB   
1746/1889 KB   
1750/1889 KB   
1754/1889 KB   
1758/1889 KB   
1762/1889 KB   
1766/1889 KB   
1770/1889 KB   
1774/1889 KB   
1778/1889 KB   
1782/1889 KB   
1786/1889 KB   
1790/1889 KB   
1794/1889 KB   
1798/1889 KB   
1802/1889 KB   
1806/1889 KB   
1810/1889 KB   
1814/1889 KB   
1818/1889 KB   
1822/1889 KB   
1826/1889 KB   
1830/1889 KB   
1834/1889 KB   
1838/1889 KB   
1842/1889 KB   
1846/1889 KB   
1850/1889 KB   
1854/1889 KB   
1858/1889 KB   
1862/1889 KB   
1866/1889 KB   
1870/1889 KB   
1874/1889 KB   
1878/1889 KB   
1882/1889 KB   
1886/1889 KB   
1889/1889 KB   
               
Downloaded: http://repo.maven.apache.org/maven2/org/apache/ant/ant/1.8.2/ant-1.8.2.jar (1889
KB at 7376.6 KB/sec)
[INFO] Executing tasks

main:
    [mkdir] Created dir: <https://builds.apache.org/job/Hama-Nightly-for-Hadoop-1.x/ws/trunk/c++/target/native>
     [exec] -- The C compiler identification is GNU 4.8.2
     [exec] -- The CXX compiler identification is GNU 4.8.2
     [exec] -- Check for working C compiler: /usr/bin/cc
     [exec] -- Check for working C compiler: /usr/bin/cc -- works
     [exec] -- Detecting C compiler ABI info
     [exec] -- Detecting C compiler ABI info - done
     [exec] -- Check for working CXX compiler: /usr/bin/c++
     [exec] -- Check for working CXX compiler: /usr/bin/c++ -- works
     [exec] -- Detecting CXX compiler ABI info
     [exec] -- Detecting CXX compiler ABI info - done
     [exec] JAVA_HOME=, JAVA_JVM_LIBRARY=/home/hudson/tools/java/latest1.7/jre/lib/i386/client/libjvm.so
     [exec] JAVA_INCLUDE_PATH=/home/hudson/tools/java/latest1.7/include, JAVA_INCLUDE_PATH2=/home/hudson/tools/java/latest1.7/include/linux
     [exec] Located all JNI components successfully.
     [exec] -- Configuring done
     [exec] -- Generating done
     [exec] -- Build files have been written to: <https://builds.apache.org/job/Hama-Nightly-for-Hadoop-1.x/ws/trunk/c++/target/native>
     [exec] /usr/bin/cmake -H<https://builds.apache.org/job/Hama-Nightly-for-Hadoop-1.x/ws/trunk/c++/src>
-B<https://builds.apache.org/job/Hama-Nightly-for-Hadoop-1.x/ws/trunk/c++/target/native>
--check-build-system CMakeFiles/Makefile.cmake 0
     [exec] /usr/bin/cmake -E cmake_progress_start <https://builds.apache.org/job/Hama-Nightly-for-Hadoop-1.x/ws/trunk/c++/target/native/CMakeFiles>
<https://builds.apache.org/job/Hama-Nightly-for-Hadoop-1.x/ws/trunk/c++/target/native/CMakeFiles/progress.marks>
     [exec] make -f CMakeFiles/Makefile2 all
     [exec] make[1]: Entering directory `<https://builds.apache.org/job/Hama-Nightly-for-Hadoop-1.x/ws/trunk/c++/target/native'>
     [exec] make -f CMakeFiles/DenseDoubleVector.dir/build.make CMakeFiles/DenseDoubleVector.dir/depend
     [exec] make[2]: Entering directory `<https://builds.apache.org/job/Hama-Nightly-for-Hadoop-1.x/ws/trunk/c++/target/native'>
     [exec] cd <https://builds.apache.org/job/Hama-Nightly-for-Hadoop-1.x/ws/trunk/c++/target/native>
&& /usr/bin/cmake -E cmake_depends "Unix Makefiles" <https://builds.apache.org/job/Hama-Nightly-for-Hadoop-1.x/ws/trunk/c++/src>
<https://builds.apache.org/job/Hama-Nightly-for-Hadoop-1.x/ws/trunk/c++/src> <https://builds.apache.org/job/Hama-Nightly-for-Hadoop-1.x/ws/trunk/c++/target/native>
<https://builds.apache.org/job/Hama-Nightly-for-Hadoop-1.x/ws/trunk/c++/target/native>
<https://builds.apache.org/job/Hama-Nightly-for-Hadoop-1.x/ws/trunk/c++/target/native/CMakeFiles/DenseDoubleVector.dir/DependInfo.cmake>
--color=
     [exec] Dependee "<https://builds.apache.org/job/Hama-Nightly-for-Hadoop-1.x/ws/trunk/c++/target/native/CMakeFiles/DenseDoubleVector.dir/DependInfo.cmake">
is newer than depender "<https://builds.apache.org/job/Hama-Nightly-for-Hadoop-1.x/ws/trunk/c++/target/native/CMakeFiles/DenseDoubleVector.dir/depend.internal".>
     [exec] Dependee "<https://builds.apache.org/job/Hama-Nightly-for-Hadoop-1.x/ws/trunk/c++/target/native/CMakeFiles/CMakeDirectoryInformation.cmake">
is newer than depender "<https://builds.apache.org/job/Hama-Nightly-for-Hadoop-1.x/ws/trunk/c++/target/native/CMakeFiles/DenseDoubleVector.dir/depend.internal".>
     [exec] Scanning dependencies of target DenseDoubleVector
     [exec] make[2]: Leaving directory `<https://builds.apache.org/job/Hama-Nightly-for-Hadoop-1.x/ws/trunk/c++/target/native'>
     [exec] make -f CMakeFiles/DenseDoubleVector.dir/build.make CMakeFiles/DenseDoubleVector.dir/build
     [exec] make[2]: Entering directory `<https://builds.apache.org/job/Hama-Nightly-for-Hadoop-1.x/ws/trunk/c++/target/native'>
     [exec] /usr/bin/cmake -E cmake_progress_report <https://builds.apache.org/job/Hama-Nightly-for-Hadoop-1.x/ws/trunk/c++/target/native/CMakeFiles>
1
     [exec] [ 14%] Building CXX object CMakeFiles/DenseDoubleVector.dir/main/native/examples/impl/DenseDoubleVector.cc.o
     [exec] /usr/bin/c++    -g -Wall -O2 -D_REENTRANT -D_GNU_SOURCE -D_LARGEFILE_SOURCE -D_FILE_OFFSET_BITS=64
-m32 -I<https://builds.apache.org/job/Hama-Nightly-for-Hadoop-1.x/ws/trunk/c++/src/main/native/utils/api>
-I<https://builds.apache.org/job/Hama-Nightly-for-Hadoop-1.x/ws/trunk/c++/src/main/native/pipes/api>
-I<https://builds.apache.org/job/Hama-Nightly-for-Hadoop-1.x/ws/trunk/c++/src>    -o
CMakeFiles/DenseDoubleVector.dir/main/native/examples/impl/DenseDoubleVector.cc.o -c <https://builds.apache.org/job/Hama-Nightly-for-Hadoop-1.x/ws/trunk/c++/src/main/native/examples/impl/DenseDoubleVector.cc>
     [exec] In file included from <https://builds.apache.org/job/Hama-Nightly-for-Hadoop-1.x/ws/trunk/c++/src/main/native/utils/api/hadoop/StringUtils.hh>:22:0,
     [exec]                  from <https://builds.apache.org/job/Hama-Nightly-for-Hadoop-1.x/ws/trunk/c++/src/main/native/examples/impl/DenseDoubleVector.cc>:19:
     [exec] /usr/include/c++/4.8/string:38:28: fatal error: bits/c++config.h: No such file
or directory
     [exec]  #include <bits/c++config.h>
     [exec]                             ^
     [exec] compilation terminated.
     [exec] make[2]: *** [CMakeFiles/DenseDoubleVector.dir/main/native/examples/impl/DenseDoubleVector.cc.o]
Error 1
     [exec] make[1]: *** [CMakeFiles/DenseDoubleVector.dir/all] Error 2
     [exec] make: *** [all] Error 2
     [exec] make[2]: Leaving directory `<https://builds.apache.org/job/Hama-Nightly-for-Hadoop-1.x/ws/trunk/c++/target/native'>
     [exec] make[1]: Leaving directory `<https://builds.apache.org/job/Hama-Nightly-for-Hadoop-1.x/ws/trunk/c++/target/native'>
[INFO] ------------------------------------------------------------------------
[INFO] Reactor Summary:
[INFO] 
[INFO] Apache Hama parent POM ............................ SUCCESS [26.277s]
[INFO] pipes ............................................. FAILURE [3.706s]
[INFO] commons ........................................... SKIPPED
[INFO] core .............................................. SKIPPED
[INFO] graph ............................................. SKIPPED
[INFO] machine learning .................................. SKIPPED
[INFO] examples .......................................... SKIPPED
[INFO] mesos ............................................. SKIPPED
[INFO] hama-dist ......................................... SKIPPED
[INFO] ------------------------------------------------------------------------
[INFO] BUILD FAILURE
[INFO] ------------------------------------------------------------------------
[INFO] Total time: 32.407s
[INFO] Finished at: Mon Jul 21 23:59:41 UTC 2014
[INFO] Final Memory: 20M/246M
[INFO] ------------------------------------------------------------------------
[ERROR] Failed to execute goal org.apache.maven.plugins:maven-antrun-plugin:1.7:run (make)
on project hama-pipes: An Ant BuildException has occured: exec returned: 2
[ERROR] around Ant part ...<exec dir="<https://builds.apache.org/job/Hama-Nightly-for-Hadoop-1.x/ws/trunk/c++/target/native">
executable="make" failonerror="true">... @ 18:146 in <https://builds.apache.org/job/Hama-Nightly-for-Hadoop-1.x/ws/trunk/c++/target/antrun/build-main.xml>
[ERROR] -> [Help 1]
[ERROR] 
[ERROR] To see the full stack trace of the errors, re-run Maven with the -e switch.
[ERROR] Re-run Maven using the -X switch to enable full debug logging.
[ERROR] 
[ERROR] For more information about the errors and possible solutions, please read the following
articles:
[ERROR] [Help 1] http://cwiki.apache.org/confluence/display/MAVEN/MojoExecutionException
[ERROR] 
[ERROR] After correcting the problems, you can resume the build with the command
[ERROR]   mvn <goals> -rf :hama-pipes
Build step 'Invoke top-level Maven targets' marked build as failure
Archiving artifacts
Sending artifact delta relative to Hama-Nightly-for-Hadoop-1.x #1303
Archived 1 artifacts
Archive block size is 32768
Received 0 blocks and 4550 bytes
Compression is 0.0%
Took 3.4 sec
Recording test results

Mime
View raw message