hama-dev mailing list archives

Site index · List index
Message view « Date » · « Thread »
Top « Date » · « Thread »
From Apache Jenkins Server <jenk...@builds.apache.org>
Subject Build failed in Jenkins: Hama-Nightly-for-Hadoop-2.x #301
Date Sun, 13 Jul 2014 23:39:07 GMT
See <https://builds.apache.org/job/Hama-Nightly-for-Hadoop-2.x/301/>

------------------------------------------
[...truncated 15053 lines...]
1265/1889 KB   
1269/1889 KB   
1273/1889 KB   
1277/1889 KB   
1281/1889 KB   
1285/1889 KB   
1289/1889 KB   
1293/1889 KB   
1297/1889 KB   
1301/1889 KB   
1305/1889 KB   
1309/1889 KB   
1313/1889 KB   
1317/1889 KB   
1321/1889 KB   
1325/1889 KB   
1329/1889 KB   
1333/1889 KB   
1337/1889 KB   
1341/1889 KB   
1345/1889 KB   
1349/1889 KB   
1351/1889 KB   
1355/1889 KB   
1359/1889 KB   
1363/1889 KB   
1367/1889 KB   
1371/1889 KB   
1375/1889 KB   
1379/1889 KB   
1383/1889 KB   
1387/1889 KB   
1391/1889 KB   
1395/1889 KB   
1399/1889 KB   
1403/1889 KB   
1407/1889 KB   
1411/1889 KB   
1415/1889 KB   
1419/1889 KB   
1423/1889 KB   
1427/1889 KB   
1431/1889 KB   
1435/1889 KB   
1439/1889 KB   
1443/1889 KB   
1447/1889 KB   
1451/1889 KB   
1455/1889 KB   
1459/1889 KB   
1463/1889 KB   
1467/1889 KB   
1471/1889 KB   
1475/1889 KB   
1479/1889 KB   
1483/1889 KB   
1487/1889 KB   
1491/1889 KB   
1495/1889 KB   
1499/1889 KB   
1503/1889 KB   
1507/1889 KB   
1511/1889 KB   
1515/1889 KB   
1519/1889 KB   
1523/1889 KB   
1527/1889 KB   
1531/1889 KB   
1535/1889 KB   
1539/1889 KB   
1543/1889 KB   
1547/1889 KB   
1551/1889 KB   
1555/1889 KB   
1559/1889 KB   
1563/1889 KB   
1567/1889 KB   
1571/1889 KB   
1575/1889 KB   
1579/1889 KB   
1583/1889 KB   
1587/1889 KB   
1591/1889 KB   
1595/1889 KB   
1599/1889 KB   
1603/1889 KB   
1604/1889 KB   
1608/1889 KB   
1612/1889 KB   
1616/1889 KB   
1620/1889 KB   
1624/1889 KB   
1628/1889 KB   
1632/1889 KB   
1636/1889 KB   
1640/1889 KB   
1644/1889 KB   
1648/1889 KB   
1652/1889 KB   
1656/1889 KB   
1660/1889 KB   
1664/1889 KB   
1668/1889 KB   
1672/1889 KB   
1676/1889 KB   
1680/1889 KB   
1684/1889 KB   
1688/1889 KB   
1692/1889 KB   
1696/1889 KB   
1700/1889 KB   
1704/1889 KB   
1708/1889 KB   
1712/1889 KB   
1716/1889 KB   
1720/1889 KB   
1724/1889 KB   
1728/1889 KB   
1732/1889 KB   
1736/1889 KB   
1740/1889 KB   
1744/1889 KB   
1748/1889 KB   
1752/1889 KB   
1756/1889 KB   
1760/1889 KB   
1764/1889 KB   
1768/1889 KB   
1772/1889 KB   
1776/1889 KB   
1780/1889 KB   
1784/1889 KB   
1788/1889 KB   
1792/1889 KB   
1796/1889 KB   
1800/1889 KB   
1804/1889 KB   
1808/1889 KB   
1812/1889 KB   
1816/1889 KB   
1820/1889 KB   
1824/1889 KB   
1828/1889 KB   
1832/1889 KB   
1836/1889 KB   
1840/1889 KB   
1844/1889 KB   
1848/1889 KB   
1852/1889 KB   
1856/1889 KB   
1860/1889 KB   
1864/1889 KB   
1868/1889 KB   
1872/1889 KB   
1876/1889 KB   
1880/1889 KB   
1881/1889 KB   
1885/1889 KB   
1889/1889 KB   
1889/1889 KB   
               
Downloaded: http://repo.maven.apache.org/maven2/org/apache/ant/ant/1.8.2/ant-1.8.2.jar (1889
KB at 5828.5 KB/sec)
[INFO] Executing tasks

main:
    [mkdir] Created dir: <https://builds.apache.org/job/Hama-Nightly-for-Hadoop-2.x/ws/trunk/c++/target/native>
     [exec] -- The C compiler identification is GNU 4.8.2
     [exec] -- The CXX compiler identification is GNU 4.8.2
     [exec] -- Check for working C compiler: /usr/bin/cc
     [exec] -- Check for working C compiler: /usr/bin/cc -- works
     [exec] -- Detecting C compiler ABI info
     [exec] -- Detecting C compiler ABI info - done
     [exec] -- Check for working CXX compiler: /usr/bin/c++
     [exec] -- Check for working CXX compiler: /usr/bin/c++ -- works
     [exec] -- Detecting CXX compiler ABI info
     [exec] JAVA_HOME=, JAVA_JVM_LIBRARY=/home/hudson/tools/java/latest1.7/jre/lib/i386/server/libjvm.so
     [exec] JAVA_INCLUDE_PATH=/home/hudson/tools/java/latest1.7/include, JAVA_INCLUDE_PATH2=/home/hudson/tools/java/latest1.7/include/linux
     [exec] Located all JNI components successfully.
     [exec] -- Detecting CXX compiler ABI info - done
     [exec] -- Configuring done
     [exec] -- Generating done
     [exec] -- Build files have been written to: <https://builds.apache.org/job/Hama-Nightly-for-Hadoop-2.x/ws/trunk/c++/target/native>
     [exec] /usr/bin/cmake -H<https://builds.apache.org/job/Hama-Nightly-for-Hadoop-2.x/ws/trunk/c++/src>
-B<https://builds.apache.org/job/Hama-Nightly-for-Hadoop-2.x/ws/trunk/c++/target/native>
--check-build-system CMakeFiles/Makefile.cmake 0
     [exec] /usr/bin/cmake -E cmake_progress_start <https://builds.apache.org/job/Hama-Nightly-for-Hadoop-2.x/ws/trunk/c++/target/native/CMakeFiles>
<https://builds.apache.org/job/Hama-Nightly-for-Hadoop-2.x/ws/trunk/c++/target/native/CMakeFiles/progress.marks>
     [exec] make -f CMakeFiles/Makefile2 all
     [exec] make[1]: Entering directory `<https://builds.apache.org/job/Hama-Nightly-for-Hadoop-2.x/ws/trunk/c++/target/native'>
     [exec] make -f CMakeFiles/DenseDoubleVector.dir/build.make CMakeFiles/DenseDoubleVector.dir/depend
     [exec] make[2]: Entering directory `<https://builds.apache.org/job/Hama-Nightly-for-Hadoop-2.x/ws/trunk/c++/target/native'>
     [exec] cd <https://builds.apache.org/job/Hama-Nightly-for-Hadoop-2.x/ws/trunk/c++/target/native>
&& /usr/bin/cmake -E cmake_depends "Unix Makefiles" <https://builds.apache.org/job/Hama-Nightly-for-Hadoop-2.x/ws/trunk/c++/src>
<https://builds.apache.org/job/Hama-Nightly-for-Hadoop-2.x/ws/trunk/c++/src> <https://builds.apache.org/job/Hama-Nightly-for-Hadoop-2.x/ws/trunk/c++/target/native>
<https://builds.apache.org/job/Hama-Nightly-for-Hadoop-2.x/ws/trunk/c++/target/native>
<https://builds.apache.org/job/Hama-Nightly-for-Hadoop-2.x/ws/trunk/c++/target/native/CMakeFiles/DenseDoubleVector.dir/DependInfo.cmake>
--color=
     [exec] Dependee "<https://builds.apache.org/job/Hama-Nightly-for-Hadoop-2.x/ws/trunk/c++/target/native/CMakeFiles/DenseDoubleVector.dir/DependInfo.cmake">
is newer than depender "<https://builds.apache.org/job/Hama-Nightly-for-Hadoop-2.x/ws/trunk/c++/target/native/CMakeFiles/DenseDoubleVector.dir/depend.internal".>
     [exec] Dependee "<https://builds.apache.org/job/Hama-Nightly-for-Hadoop-2.x/ws/trunk/c++/target/native/CMakeFiles/CMakeDirectoryInformation.cmake">
is newer than depender "<https://builds.apache.org/job/Hama-Nightly-for-Hadoop-2.x/ws/trunk/c++/target/native/CMakeFiles/DenseDoubleVector.dir/depend.internal".>
     [exec] Scanning dependencies of target DenseDoubleVector
     [exec] make[2]: Leaving directory `<https://builds.apache.org/job/Hama-Nightly-for-Hadoop-2.x/ws/trunk/c++/target/native'>
     [exec] make -f CMakeFiles/DenseDoubleVector.dir/build.make CMakeFiles/DenseDoubleVector.dir/build
     [exec] make[2]: Entering directory `<https://builds.apache.org/job/Hama-Nightly-for-Hadoop-2.x/ws/trunk/c++/target/native'>
     [exec] /usr/bin/cmake -E cmake_progress_report <https://builds.apache.org/job/Hama-Nightly-for-Hadoop-2.x/ws/trunk/c++/target/native/CMakeFiles>
1
     [exec] [ 14%] Building CXX object CMakeFiles/DenseDoubleVector.dir/main/native/examples/impl/DenseDoubleVector.cc.o
     [exec] /usr/bin/c++    -g -Wall -O2 -D_REENTRANT -D_GNU_SOURCE -D_LARGEFILE_SOURCE -D_FILE_OFFSET_BITS=64
-m32 -I<https://builds.apache.org/job/Hama-Nightly-for-Hadoop-2.x/ws/trunk/c++/src/main/native/utils/api>
-I<https://builds.apache.org/job/Hama-Nightly-for-Hadoop-2.x/ws/trunk/c++/src/main/native/pipes/api>
-I<https://builds.apache.org/job/Hama-Nightly-for-Hadoop-2.x/ws/trunk/c++/src>    -o
CMakeFiles/DenseDoubleVector.dir/main/native/examples/impl/DenseDoubleVector.cc.o -c <https://builds.apache.org/job/Hama-Nightly-for-Hadoop-2.x/ws/trunk/c++/src/main/native/examples/impl/DenseDoubleVector.cc>
     [exec] make[2]: Leaving directory `<https://builds.apache.org/job/Hama-Nightly-for-Hadoop-2.x/ws/trunk/c++/target/native'>
     [exec] make[1]: Leaving directory `<https://builds.apache.org/job/Hama-Nightly-for-Hadoop-2.x/ws/trunk/c++/target/native'>
     [exec] In file included from <https://builds.apache.org/job/Hama-Nightly-for-Hadoop-2.x/ws/trunk/c++/src/main/native/utils/api/hadoop/StringUtils.hh>:22:0,
     [exec]                  from <https://builds.apache.org/job/Hama-Nightly-for-Hadoop-2.x/ws/trunk/c++/src/main/native/examples/impl/DenseDoubleVector.cc>:19:
     [exec] /usr/include/c++/4.8/string:38:28: fatal error: bits/c++config.h: No such file
or directory
     [exec]  #include <bits/c++config.h>
     [exec]                             ^
     [exec] compilation terminated.
     [exec] make[2]: *** [CMakeFiles/DenseDoubleVector.dir/main/native/examples/impl/DenseDoubleVector.cc.o]
Error 1
     [exec] make[1]: *** [CMakeFiles/DenseDoubleVector.dir/all] Error 2
     [exec] make: *** [all] Error 2
[INFO] ------------------------------------------------------------------------
[INFO] Reactor Summary:
[INFO] 
[INFO] Apache Hama parent POM ............................ SUCCESS [32.190s]
[INFO] pipes ............................................. FAILURE [3.944s]
[INFO] commons ........................................... SKIPPED
[INFO] core .............................................. SKIPPED
[INFO] graph ............................................. SKIPPED
[INFO] machine learning .................................. SKIPPED
[INFO] examples .......................................... SKIPPED
[INFO] mesos ............................................. SKIPPED
[INFO] hama-dist ......................................... SKIPPED
[INFO] ------------------------------------------------------------------------
[INFO] BUILD FAILURE
[INFO] ------------------------------------------------------------------------
[INFO] Total time: 38.396s
[INFO] Finished at: Sun Jul 13 23:38:29 UTC 2014
[INFO] Final Memory: 18M/122M
[INFO] ------------------------------------------------------------------------
[ERROR] Failed to execute goal org.apache.maven.plugins:maven-antrun-plugin:1.7:run (make)
on project hama-pipes: An Ant BuildException has occured: exec returned: 2
[ERROR] around Ant part ...<exec dir="<https://builds.apache.org/job/Hama-Nightly-for-Hadoop-2.x/ws/trunk/c++/target/native">
executable="make" failonerror="true">... @ 18:146 in <https://builds.apache.org/job/Hama-Nightly-for-Hadoop-2.x/ws/trunk/c++/target/antrun/build-main.xml>
[ERROR] -> [Help 1]
[ERROR] 
[ERROR] To see the full stack trace of the errors, re-run Maven with the -e switch.
[ERROR] Re-run Maven using the -X switch to enable full debug logging.
[ERROR] 
[ERROR] For more information about the errors and possible solutions, please read the following
articles:
[ERROR] [Help 1] http://cwiki.apache.org/confluence/display/MAVEN/MojoExecutionException
[ERROR] 
[ERROR] After correcting the problems, you can resume the build with the command
[ERROR]   mvn <goals> -rf :hama-pipes
Build step 'Invoke top-level Maven targets' marked build as failure
Archiving artifacts
Sending artifact delta relative to Hama-Nightly-for-Hadoop-2.x #300
Archived 1 artifacts
Archive block size is 32768
Received 0 blocks and 4550 bytes
Compression is 0.0%
Took 3.5 sec
Recording test results

Mime
View raw message