hama-dev mailing list archives

Site index · List index
Message view « Date » · « Thread »
Top « Date » · « Thread »
From Apache Jenkins Server <jenk...@builds.apache.org>
Subject Build failed in Jenkins: Hama-Nightly-for-Hadoop-1.x #1290
Date Sun, 29 Jun 2014 00:04:04 GMT
See <https://builds.apache.org/job/Hama-Nightly-for-Hadoop-1.x/1290/changes>

Changes:

[edwardyoon] Rename loopBackMessages to loopBackMessage

------------------------------------------
[...truncated 23593 lines...]
14/06/29 00:03:42 INFO bsp.BSPJobClient:   org.apache.hama.bsp.JobInProgress$JobCounter

14/06/29 00:03:42 INFO bsp.BSPJobClient:     SUPERSTEPS=14

14/06/29 00:03:42 INFO bsp.BSPJobClient:     LAUNCHED_TASKS=3

14/06/29 00:03:42 INFO bsp.BSPJobClient:   org.apache.hama.bsp.BSPPeerImpl$PeerCounter

14/06/29 00:03:42 INFO bsp.BSPJobClient:     SUPERSTEP_SUM=45

14/06/29 00:03:42 INFO bsp.BSPJobClient:     MESSAGE_BYTES_TRANSFERED=2565

14/06/29 00:03:42 INFO bsp.BSPJobClient:     TIME_IN_SYNC_MS=67

14/06/29 00:03:42 INFO bsp.BSPJobClient:     TOTAL_MESSAGES_SENT=135

14/06/29 00:03:42 INFO bsp.BSPJobClient:     TOTAL_MESSAGES_RECEIVED=135

14/06/29 00:03:42 INFO bsp.BSPJobClient:     TASK_OUTPUT_RECORDS=135

Tests run: 1, Failures: 0, Errors: 0, Skipped: 0, Time elapsed: 0.01 sec
Running org.apache.hama.zookeeper.TestZKTools
Tests run: 1, Failures: 0, Errors: 0, Skipped: 0, Time elapsed: 0.01 sec
Running org.apache.hama.bsp.TestZooKeeper
14/06/29 00:03:44 ERROR quorum.QuorumPeerConfig: Invalid configuration, only one server specified
(ignoring)

14/06/29 00:03:44 INFO server.ZooKeeperServerMain: Starting server

14/06/29 00:03:44 INFO server.ZooKeeperServer: Server environment:zookeeper.version=3.4.5-1392090,
built on 09/30/2012 17:52 GMT

14/06/29 00:03:44 INFO server.ZooKeeperServer: Server environment:host.name=vesta.apache.org

14/06/29 00:03:44 INFO server.ZooKeeperServer: Server environment:java.version=1.7.0_25

14/06/29 00:03:44 INFO server.ZooKeeperServer: Server environment:java.vendor=Oracle Corporation

14/06/29 00:03:44 INFO server.ZooKeeperServer: Server environment:java.home=/home/hudson/tools/java/jdk1.7.0_25-32/jre

14/06/29 00:03:44 INFO server.ZooKeeperServer: Server environment:java.class.path=/tmp/surefirebooter7814434419537061591.jar

14/06/29 00:03:44 INFO server.ZooKeeperServer: Server environment:java.library.path=/usr/java/packages/lib/i386:/lib:/usr/lib

14/06/29 00:03:44 INFO server.ZooKeeperServer: Server environment:java.io.tmpdir=/tmp

14/06/29 00:03:44 INFO server.ZooKeeperServer: Server environment:java.compiler=<NA>

14/06/29 00:03:44 INFO server.ZooKeeperServer: Server environment:os.name=Linux

14/06/29 00:03:44 INFO server.ZooKeeperServer: Server environment:os.arch=i386

14/06/29 00:03:44 INFO server.ZooKeeperServer: Server environment:os.version=3.2.0-51-generic

14/06/29 00:03:44 INFO server.ZooKeeperServer: Server environment:user.name=jenkins

14/06/29 00:03:44 INFO server.ZooKeeperServer: Server environment:user.home=/home/jenkins

14/06/29 00:03:44 INFO server.ZooKeeperServer: Server environment:user.dir=/tmp

14/06/29 00:03:44 INFO server.ZooKeeperServer: tickTime set to 3000

14/06/29 00:03:44 INFO server.ZooKeeperServer: minSessionTimeout set to -1

14/06/29 00:03:44 INFO server.ZooKeeperServer: maxSessionTimeout set to 1200000

14/06/29 00:03:44 INFO server.NIOServerCnxnFactory: binding to port 0.0.0.0/0.0.0.0:20000

14/06/29 00:03:44 INFO persistence.FileSnap: Reading snapshot /tmp/hama-testzookeeper/version-2/snapshot.152

14/06/29 00:03:44 INFO persistence.FileTxnSnapLog: Snapshotting: 0x157 to /tmp/hama-testzookeeper/version-2/snapshot.157

14/06/29 00:03:54 INFO zookeeper.ZooKeeper: Client environment:zookeeper.version=3.4.5-1392090,
built on 09/30/2012 17:52 GMT

14/06/29 00:03:54 INFO zookeeper.ZooKeeper: Client environment:host.name=vesta.apache.org

14/06/29 00:03:54 INFO zookeeper.ZooKeeper: Client environment:java.version=1.7.0_25

14/06/29 00:03:54 INFO zookeeper.ZooKeeper: Client environment:java.vendor=Oracle Corporation

14/06/29 00:03:54 INFO zookeeper.ZooKeeper: Client environment:java.home=/home/hudson/tools/java/jdk1.7.0_25-32/jre

14/06/29 00:03:54 INFO zookeeper.ZooKeeper: Client environment:java.class.path=/tmp/surefirebooter7814434419537061591.jar

14/06/29 00:03:54 INFO zookeeper.ZooKeeper: Client environment:java.library.path=/usr/java/packages/lib/i386:/lib:/usr/lib

14/06/29 00:03:54 INFO zookeeper.ZooKeeper: Client environment:java.io.tmpdir=/tmp

14/06/29 00:03:54 INFO zookeeper.ZooKeeper: Client environment:java.compiler=<NA>

14/06/29 00:03:54 INFO zookeeper.ZooKeeper: Client environment:os.name=Linux

14/06/29 00:03:54 INFO zookeeper.ZooKeeper: Client environment:os.arch=i386

14/06/29 00:03:54 INFO zookeeper.ZooKeeper: Client environment:os.version=3.2.0-51-generic

14/06/29 00:03:54 INFO zookeeper.ZooKeeper: Client environment:user.name=jenkins

14/06/29 00:03:54 INFO zookeeper.ZooKeeper: Client environment:user.home=/home/jenkins

14/06/29 00:03:54 INFO zookeeper.ZooKeeper: Client environment:user.dir=/tmp

14/06/29 00:03:54 INFO zookeeper.ZooKeeper: Initiating client connection, connectString=localhost:20000
sessionTimeout=1200000 watcher=org.apache.hama.bsp.sync.ZKSyncBSPMasterClient@2d1d1e

14/06/29 00:03:54 INFO sync.ZKSyncBSPMasterClient: Initialized ZK false

14/06/29 00:03:54 INFO sync.ZKSyncClient: Initializing ZK Sync Client

14/06/29 00:03:54 INFO zookeeper.ClientCnxn: Opening socket connection to server localhost/127.0.0.1:20000.
Will not attempt to authenticate using SASL (unknown error)

14/06/29 00:03:54 INFO zookeeper.ClientCnxn: Socket connection established to localhost/127.0.0.1:20000,
initiating session

14/06/29 00:03:54 INFO server.NIOServerCnxnFactory: Accepted socket connection from /127.0.0.1:48061

14/06/29 00:03:54 INFO server.ZooKeeperServer: Client attempting to establish new session
at /127.0.0.1:48061

14/06/29 00:03:54 INFO persistence.FileTxnLog: Creating new log file: log.158

14/06/29 00:03:54 INFO server.ZooKeeperServer: Established session 0x146e4ef441d0000 with
negotiated timeout 1200000 for client /127.0.0.1:48061

14/06/29 00:03:54 INFO zookeeper.ClientCnxn: Session establishment complete on server localhost/127.0.0.1:20000,
sessionid = 0x146e4ef441d0000, negotiated timeout = 1200000

14/06/29 00:03:54 INFO mortbay.log: Logging to org.slf4j.impl.Log4jLoggerAdapter(org.mortbay.log)
via org.mortbay.log.Slf4jLog

14/06/29 00:03:54 INFO mortbay.log: Created master and client sync clients

14/06/29 00:03:54 INFO mortbay.log: BSP root exists

14/06/29 00:03:54 INFO zookeeper.ZooKeeper: Initiating client connection, connectString=localhost:20000
sessionTimeout=1200000 watcher=org.apache.hama.bsp.sync.ZooKeeperSyncClientImpl@1f1a75d

14/06/29 00:03:54 INFO sync.ZKSyncClient: Initializing ZK Sync Client

14/06/29 00:03:54 INFO sync.ZooKeeperSyncClientImpl: Start connecting to Zookeeper! At /0.0.0.0:21815

14/06/29 00:03:54 INFO zookeeper.ClientCnxn: Opening socket connection to server localhost/127.0.0.1:20000.
Will not attempt to authenticate using SASL (unknown error)

14/06/29 00:03:54 INFO zookeeper.ClientCnxn: Socket connection established to localhost/127.0.0.1:20000,
initiating session

14/06/29 00:03:54 INFO server.NIOServerCnxnFactory: Accepted socket connection from /127.0.0.1:48062

14/06/29 00:03:54 INFO server.ZooKeeperServer: Client attempting to establish new session
at /127.0.0.1:48062

14/06/29 00:03:54 INFO server.ZooKeeperServer: Established session 0x146e4ef441d0001 with
negotiated timeout 1200000 for client /127.0.0.1:48062

14/06/29 00:03:54 INFO zookeeper.ClientCnxn: Session establishment complete on server localhost/127.0.0.1:20000,
sessionid = 0x146e4ef441d0001, negotiated timeout = 1200000

14/06/29 00:03:54 INFO sync.ZKSyncClient: Writing data /bsp/job_test1_0001/info/level2

14/06/29 00:03:54 INFO mortbay.log: Found child count = 2

14/06/29 00:03:54 INFO mortbay.log: Passed the child count test

14/06/29 00:03:54 INFO mortbay.log: Found child count = 2

14/06/29 00:03:54 INFO mortbay.log:  Peer name 2

14/06/29 00:03:54 INFO mortbay.log:  Peer name 1

14/06/29 00:03:54 INFO mortbay.log: Passed the child key set test

14/06/29 00:03:54 INFO mortbay.log: /bsp/job_test1_0001

14/06/29 00:03:54 INFO mortbay.log: Passed the key presence test

14/06/29 00:03:54 INFO sync.ZKSyncClient: Writing data /bsp/job_test1_0001/info/level3

14/06/29 00:03:54 INFO mortbay.log: Passed array writable test

14/06/29 00:03:54 INFO server.NIOServerCnxn: Closed socket connection for client /127.0.0.1:48061
which had sessionid 0x146e4ef441d0000

14/06/29 00:03:54 INFO zookeeper.ClientCnxn: Unable to read additional data from server sessionid
0x146e4ef441d0000, likely server has closed socket, closing socket connection and attempting
reconnect

14/06/29 00:03:54 INFO server.NIOServerCnxn: Closed socket connection for client /127.0.0.1:48062
which had sessionid 0x146e4ef441d0001

14/06/29 00:03:54 INFO zookeeper.ClientCnxn: Unable to read additional data from server sessionid
0x146e4ef441d0001, likely server has closed socket, closing socket connection and attempting
reconnect

14/06/29 00:03:54 INFO server.NIOServerCnxnFactory: NIOServerCnxn factory exited run method

14/06/29 00:03:54 INFO server.ZooKeeperServer: shutting down

14/06/29 00:03:54 INFO server.ZooKeeperServer: shutting down

14/06/29 00:03:54 INFO server.SessionTrackerImpl: Shutting down

14/06/29 00:03:54 INFO server.SessionTrackerImpl: Shutting down

14/06/29 00:03:54 INFO server.PrepRequestProcessor: Shutting down

14/06/29 00:03:54 INFO server.PrepRequestProcessor: Shutting down

14/06/29 00:03:54 INFO server.SyncRequestProcessor: Shutting down

14/06/29 00:03:54 INFO server.SyncRequestProcessor: Shutting down

14/06/29 00:03:54 INFO server.SyncRequestProcessor: SyncRequestProcessor exited!

14/06/29 00:03:54 INFO server.PrepRequestProcessor: PrepRequestProcessor exited loop!

14/06/29 00:03:54 INFO server.FinalRequestProcessor: shutdown of request processor complete

14/06/29 00:03:54 INFO server.FinalRequestProcessor: shutdown of request processor complete

Tests run: 1, Failures: 0, Errors: 0, Skipped: 0, Time elapsed: 0.017 sec

Results :

Failed tests: 

Tests run: 65, Failures: 2, Errors: 0, Skipped: 0

[INFO] ------------------------------------------------------------------------
[INFO] Reactor Summary:
[INFO] 
[INFO] Apache Hama parent POM ............................ SUCCESS [25.182s]
[INFO] pipes ............................................. SUCCESS [22.541s]
[INFO] commons ........................................... SUCCESS [9.343s]
[INFO] core .............................................. FAILURE [3:20.858s]
[INFO] graph ............................................. SKIPPED
[INFO] machine learning .................................. SKIPPED
[INFO] examples .......................................... SKIPPED
[INFO] mesos ............................................. SKIPPED
[INFO] hama-dist ......................................... SKIPPED
[INFO] ------------------------------------------------------------------------
[INFO] BUILD FAILURE
[INFO] ------------------------------------------------------------------------
[INFO] Total time: 4:19.269s
[INFO] Finished at: Sun Jun 29 00:03:54 UTC 2014
[INFO] Final Memory: 51M/262M
[INFO] ------------------------------------------------------------------------
[ERROR] Failed to execute goal org.apache.maven.plugins:maven-surefire-plugin:2.6:test (default-test)
on project hama-core: There are test failures.
[ERROR] 
[ERROR] Please refer to /home/hudson/jenkins-slave/workspace/Hama-Nightly-for-Hadoop-1.x/trunk/core/target/surefire-reports
for the individual test results.
[ERROR] -> [Help 1]
[ERROR] 
[ERROR] To see the full stack trace of the errors, re-run Maven with the -e switch.
[ERROR] Re-run Maven using the -X switch to enable full debug logging.
[ERROR] 
[ERROR] For more information about the errors and possible solutions, please read the following
articles:
[ERROR] [Help 1] http://cwiki.apache.org/confluence/display/MAVEN/MojoFailureException
[ERROR] 
[ERROR] After correcting the problems, you can resume the build with the command
[ERROR]   mvn <goals> -rf :hama-core
Build step 'Invoke top-level Maven targets' marked build as failure
Archiving artifacts
Sending artifact delta relative to Hama-Nightly-for-Hadoop-1.x #1289
Archived 68 artifacts
Archive block size is 32768
Received 0 blocks and 215307 bytes
Compression is 0.0%
Took 5.8 sec
Recording test results

Mime
View raw message