hama-dev mailing list archives

Site index · List index
Message view « Date » · « Thread »
Top « Date » · « Thread »
From Apache Jenkins Server <jenk...@builds.apache.org>
Subject Build failed in Jenkins: Hama-Nightly-for-Hadoop-2.x #256
Date Fri, 30 May 2014 00:33:36 GMT
See <https://builds.apache.org/job/Hama-Nightly-for-Hadoop-2.x/256/>

------------------------------------------
[...truncated 27637 lines...]

14/05/30 00:32:25 INFO bsp.GroomServer: Launch 3 tasks.

14/05/30 00:32:25 WARN bsp.GroomServer: No jar file for job job_201405300032_0002 has been
defined!

14/05/30 00:32:25 INFO bsp.GroomServer: Task 'attempt_201405300032_0002_000002_0' has started.

14/05/30 00:32:25 INFO bsp.GroomServer: Launch 3 tasks.

14/05/30 00:32:25 INFO bsp.GroomServer: Task 'attempt_201405300032_0002_000000_0' has started.

14/05/30 00:32:25 INFO bsp.GroomServer: Launch 3 tasks.

Error: Could not find or load main class org.apache.hama.bsp.GroomServer$BSPPeerChild

14/05/30 00:32:25 ERROR bsp.TaskRunner: Error when executing BSPPeer process.
java.io.IOException: BSP task process exit with nonzero status of 1. command = [/x1/jenkins/tools/java/jdk1.7.0_25-32/jre/bin/java,
-Xmx200m, -classpath, /tmp/surefirebooter6632040011469040534.jar:, org.apache.hama.bsp.GroomServer$BSPPeerChild,
localhost, 48740, attempt_201405300032_0002_000002_0, hemera.apache.org, -1, RUNNING]
	at org.apache.hama.bsp.TaskRunner$BspChildRunner.call(TaskRunner.java:127)
	at java.util.concurrent.FutureTask$Sync.innerRun(FutureTask.java:334)
	at java.util.concurrent.FutureTask.run(FutureTask.java:166)
	at java.util.concurrent.ScheduledThreadPoolExecutor$ScheduledFutureTask.access$201(ScheduledThreadPoolExecutor.java:178)
	at java.util.concurrent.ScheduledThreadPoolExecutor$ScheduledFutureTask.run(ScheduledThreadPoolExecutor.java:292)
	at java.util.concurrent.ThreadPoolExecutor.runWorker(ThreadPoolExecutor.java:1145)
	at java.util.concurrent.ThreadPoolExecutor$Worker.run(ThreadPoolExecutor.java:615)
	at java.lang.Thread.run(Thread.java:724)

14/05/30 00:32:25 INFO bsp.GroomServer: Task 'attempt_201405300032_0002_000001_0' has started.

Error: Could not find or load main class org.apache.hama.bsp.GroomServer$BSPPeerChild

14/05/30 00:32:25 ERROR bsp.TaskRunner: Error when executing BSPPeer process.
java.io.IOException: BSP task process exit with nonzero status of 1. command = [/x1/jenkins/tools/java/jdk1.7.0_25-32/jre/bin/java,
-Xmx200m, -classpath, /tmp/surefirebooter6632040011469040534.jar:, org.apache.hama.bsp.GroomServer$BSPPeerChild,
localhost, 48740, attempt_201405300032_0002_000000_0, hemera.apache.org, -1, RUNNING]
	at org.apache.hama.bsp.TaskRunner$BspChildRunner.call(TaskRunner.java:127)
	at java.util.concurrent.FutureTask$Sync.innerRun(FutureTask.java:334)
	at java.util.concurrent.FutureTask.run(FutureTask.java:166)
	at java.util.concurrent.ScheduledThreadPoolExecutor$ScheduledFutureTask.access$201(ScheduledThreadPoolExecutor.java:178)
	at java.util.concurrent.ScheduledThreadPoolExecutor$ScheduledFutureTask.run(ScheduledThreadPoolExecutor.java:292)
	at java.util.concurrent.ThreadPoolExecutor.runWorker(ThreadPoolExecutor.java:1145)
	at java.util.concurrent.ThreadPoolExecutor$Worker.run(ThreadPoolExecutor.java:615)
	at java.lang.Thread.run(Thread.java:724)

Error: Could not find or load main class org.apache.hama.bsp.GroomServer$BSPPeerChild

14/05/30 00:32:25 ERROR bsp.TaskRunner: Error when executing BSPPeer process.
java.io.IOException: BSP task process exit with nonzero status of 1. command = [/x1/jenkins/tools/java/jdk1.7.0_25-32/jre/bin/java,
-Xmx200m, -classpath, /tmp/surefirebooter6632040011469040534.jar:, org.apache.hama.bsp.GroomServer$BSPPeerChild,
localhost, 48740, attempt_201405300032_0002_000001_0, hemera.apache.org, -1, RUNNING]
	at org.apache.hama.bsp.TaskRunner$BspChildRunner.call(TaskRunner.java:127)
	at java.util.concurrent.FutureTask$Sync.innerRun(FutureTask.java:334)
	at java.util.concurrent.FutureTask.run(FutureTask.java:166)
	at java.util.concurrent.ScheduledThreadPoolExecutor$ScheduledFutureTask.access$201(ScheduledThreadPoolExecutor.java:178)
	at java.util.concurrent.ScheduledThreadPoolExecutor$ScheduledFutureTask.run(ScheduledThreadPoolExecutor.java:292)
	at java.util.concurrent.ThreadPoolExecutor.runWorker(ThreadPoolExecutor.java:1145)
	at java.util.concurrent.ThreadPoolExecutor$Worker.run(ThreadPoolExecutor.java:615)
	at java.lang.Thread.run(Thread.java:724)

14/05/30 00:33:16 INFO bsp.GroomServer: adding purge task: attempt_201405300032_0002_000000_0

14/05/30 00:33:16 INFO bsp.GroomServer: adding purge task: attempt_201405300032_0002_000002_0

14/05/30 00:33:16 INFO bsp.GroomServer: adding purge task: attempt_201405300032_0002_000001_0

14/05/30 00:33:16 INFO bsp.GroomServer: About to purge task: attempt_201405300032_0002_000000_0

14/05/30 00:33:16 INFO bsp.GroomServer: About to purge task: attempt_201405300032_0002_000002_0

14/05/30 00:33:16 INFO bsp.GroomServer: About to purge task: attempt_201405300032_0002_000001_0

14/05/30 00:33:16 INFO bsp.JobInProgress: Taskid 'attempt_201405300032_0002_000000_0' has
failed.

14/05/30 00:33:16 INFO bsp.TaskInProgress: Task 'task_201405300032_0002_000000' has failed.

14/05/30 00:33:16 INFO bsp.JobInProgress: Job failed.

14/05/30 00:33:16 INFO bsp.GroomServer: Kill 1 tasks.

14/05/30 00:33:16 INFO bsp.JobInProgress: Taskid 'attempt_201405300032_0002_000002_0' has
failed.

14/05/30 00:33:16 INFO bsp.TaskInProgress: Task 'task_201405300032_0002_000002' has failed.

14/05/30 00:33:16 INFO bsp.JobInProgress: Job failed.

14/05/30 00:33:16 INFO bsp.GroomServer: Kill 1 tasks.

14/05/30 00:33:16 INFO bsp.JobInProgress: Taskid 'attempt_201405300032_0002_000001_0' has
failed.

14/05/30 00:33:16 INFO bsp.TaskInProgress: Task 'task_201405300032_0002_000001' has failed.

14/05/30 00:33:16 INFO bsp.JobInProgress: Job failed.

14/05/30 00:33:16 INFO bsp.GroomServer: Kill 1 tasks.

14/05/30 00:33:17 INFO bsp.BSPJobClient: Job failed.

14/05/30 00:33:17 INFO pipes.TestPipes: Client finishes execution job

14/05/30 00:33:17 INFO server.PrepRequestProcessor: Processed session termination for sessionid:
0x1464a8aa7e80000

14/05/30 00:33:17 INFO zookeeper.ZooKeeper: Session: 0x1464a8aa7e80000 closed

14/05/30 00:33:17 INFO server.NIOServerCnxn: Closed socket connection for client /0:0:0:0:0:0:0:1:54409
which had sessionid 0x1464a8aa7e80000

14/05/30 00:33:17 INFO zookeeper.ClientCnxn: EventThread shut down

14/05/30 00:33:17 INFO ipc.Server: Stopping server on 40000

14/05/30 00:33:17 INFO ipc.Server: IPC Server handler 0 on 40000: exiting

14/05/30 00:33:17 INFO ipc.Server: Stopping IPC Server listener on 40000

14/05/30 00:33:17 INFO bsp.BSPMaster: Stopped RPC Master server.

14/05/30 00:33:17 INFO ipc.Server: Stopping IPC Server Responder

14/05/30 00:33:17 INFO server.PrepRequestProcessor: Processed session termination for sessionid:
0x1464a8aa7e80001

14/05/30 00:33:17 INFO zookeeper.ZooKeeper: Session: 0x1464a8aa7e80001 closed

14/05/30 00:33:17 INFO server.NIOServerCnxn: Closed socket connection for client /0:0:0:0:0:0:0:1:54410
which had sessionid 0x1464a8aa7e80001

14/05/30 00:33:17 INFO zookeeper.ClientCnxn: EventThread shut down

14/05/30 00:33:17 INFO ipc.Server: Stopping server on 53252

14/05/30 00:33:17 INFO ipc.Server: IPC Server handler 0 on 53252: exiting

14/05/30 00:33:17 INFO ipc.Server: Stopping IPC Server listener on 53252

14/05/30 00:33:17 INFO ipc.Server: Stopping server on 48740

14/05/30 00:33:17 INFO ipc.Server: Stopping IPC Server Responder

14/05/30 00:33:17 INFO ipc.Server: IPC Server handler 0 on 48740: exiting

14/05/30 00:33:17 INFO ipc.Server: IPC Server handler 2 on 48740: exiting

14/05/30 00:33:17 INFO ipc.Server: IPC Server handler 1 on 48740: exiting

14/05/30 00:33:17 INFO ipc.Server: IPC Server handler 3 on 48740: exiting

14/05/30 00:33:17 INFO ipc.Server: Stopping IPC Server Responder

14/05/30 00:33:17 INFO ipc.Server: Stopping IPC Server listener on 48740

14/05/30 00:33:17 INFO ipc.Server: IPC Server handler 4 on 48740: exiting

14/05/30 00:33:17 INFO server.NIOServerCnxnFactory: NIOServerCnxn factory exited run method

14/05/30 00:33:17 INFO server.ZooKeeperServer: shutting down

14/05/30 00:33:17 INFO server.SessionTrackerImpl: Shutting down

14/05/30 00:33:17 INFO server.PrepRequestProcessor: Shutting down

14/05/30 00:33:17 INFO server.SyncRequestProcessor: Shutting down

14/05/30 00:33:17 INFO server.PrepRequestProcessor: PrepRequestProcessor exited loop!

14/05/30 00:33:17 INFO server.SyncRequestProcessor: SyncRequestProcessor exited!

14/05/30 00:33:17 INFO server.FinalRequestProcessor: shutdown of request processor complete

Tests run: 1, Failures: 1, Errors: 0, Skipped: 0, Time elapsed: 0.026 sec <<< FAILURE!
Running org.apache.hama.monitor.TestConfigurator
14/05/30 00:33:18 INFO monitor.TestConfigurator: Plugins dir is not created, returned tasks
should be null -> null

Tests run: 1, Failures: 0, Errors: 0, Skipped: 0, Time elapsed: 0.008 sec
Running org.apache.hama.bsp.TestLocalRunner
14/05/30 00:33:19 WARN util.NativeCodeLoader: Unable to load native-hadoop library for your
platform... using builtin-java classes where applicable

14/05/30 00:33:19 WARN bsp.BSPJobClient: No job jar file set.  User classes may not be found.
See BSPJob#setJar(String) or check Your jar file.

14/05/30 00:33:19 INFO bsp.BSPJobClient: Running job: job_localrunner_0001

14/05/30 00:33:19 INFO bsp.LocalBSPRunner: Setting up a new barrier for 3 tasks!

14/05/30 00:33:22 INFO bsp.BSPJobClient: Current supersteps number: 14

14/05/30 00:33:22 INFO bsp.BSPJobClient: The total number of supersteps: 14

14/05/30 00:33:22 INFO bsp.BSPJobClient: Counters: 8

14/05/30 00:33:22 INFO bsp.BSPJobClient:   org.apache.hama.bsp.JobInProgress$JobCounter

14/05/30 00:33:22 INFO bsp.BSPJobClient:     SUPERSTEPS=14

14/05/30 00:33:22 INFO bsp.BSPJobClient:     LAUNCHED_TASKS=3

14/05/30 00:33:22 INFO bsp.BSPJobClient:   org.apache.hama.bsp.BSPPeerImpl$PeerCounter

14/05/30 00:33:22 INFO bsp.BSPJobClient:     SUPERSTEP_SUM=45

14/05/30 00:33:22 INFO bsp.BSPJobClient:     MESSAGE_BYTES_TRANSFERED=2565

14/05/30 00:33:22 INFO bsp.BSPJobClient:     TIME_IN_SYNC_MS=16

14/05/30 00:33:22 INFO bsp.BSPJobClient:     TOTAL_MESSAGES_SENT=135

14/05/30 00:33:22 INFO bsp.BSPJobClient:     TOTAL_MESSAGES_RECEIVED=135

14/05/30 00:33:22 INFO bsp.BSPJobClient:     TASK_OUTPUT_RECORDS=135

Tests run: 1, Failures: 0, Errors: 0, Skipped: 0, Time elapsed: 0.012 sec
Running org.apache.hama.bsp.message.TestSpillingQueue
Tests run: 2, Failures: 0, Errors: 0, Skipped: 0, Time elapsed: 0.012 sec
Running org.apache.hama.bsp.TestZooKeeper
14/05/30 00:33:23 ERROR quorum.QuorumPeerConfig: Invalid configuration, only one server specified
(ignoring)

Running org.apache.hama.zookeeper.TestZKTools
Tests run: 1, Failures: 0, Errors: 0, Skipped: 0, Time elapsed: 0.014 sec

Results :

Failed tests: 

Tests run: 64, Failures: 1, Errors: 0, Skipped: 0

[INFO] ------------------------------------------------------------------------
[INFO] Reactor Summary:
[INFO] 
[INFO] Apache Hama parent POM ............................ SUCCESS [33.480s]
[INFO] pipes ............................................. SUCCESS [18.518s]
[INFO] commons ........................................... SUCCESS [9.182s]
[INFO] core .............................................. FAILURE [3:40.372s]
[INFO] graph ............................................. SKIPPED
[INFO] machine learning .................................. SKIPPED
[INFO] examples .......................................... SKIPPED
[INFO] hama-dist ......................................... SKIPPED
[INFO] ------------------------------------------------------------------------
[INFO] BUILD FAILURE
[INFO] ------------------------------------------------------------------------
[INFO] Total time: 4:43.679s
[INFO] Finished at: Fri May 30 00:33:35 UTC 2014
[INFO] Final Memory: 60M/196M
[INFO] ------------------------------------------------------------------------
[ERROR] Failed to execute goal org.apache.maven.plugins:maven-surefire-plugin:2.6:test (default-test)
on project hama-core: There are test failures.
[ERROR] 
[ERROR] Please refer to /x1/jenkins/jenkins-slave/workspace/Hama-Nightly-for-Hadoop-2.x/trunk/core/target/surefire-reports
for the individual test results.
[ERROR] -> [Help 1]
[ERROR] 
[ERROR] To see the full stack trace of the errors, re-run Maven with the -e switch.
[ERROR] Re-run Maven using the -X switch to enable full debug logging.
[ERROR] 
[ERROR] For more information about the errors and possible solutions, please read the following
articles:
[ERROR] [Help 1] http://cwiki.apache.org/confluence/display/MAVEN/MojoFailureException
[ERROR] 
[ERROR] After correcting the problems, you can resume the build with the command
[ERROR]   mvn <goals> -rf :hama-core
Build step 'Invoke top-level Maven targets' marked build as failure
Archiving artifacts
Recording test results

Mime
View raw message