hama-dev mailing list archives

Site index · List index
Message view « Date » · « Thread »
Top « Date » · « Thread »
From Apache Jenkins Server <jenk...@builds.apache.org>
Subject Build failed in Jenkins: Hama-Nightly-for-Hadoop-1.x #1226
Date Tue, 01 Apr 2014 00:10:04 GMT
See <https://builds.apache.org/job/Hama-Nightly-for-Hadoop-1.x/1226/>

------------------------------------------
[...truncated 852 lines...]
[INFO] --- maven-clean-plugin:2.4.1:clean (default-clean) @ hama-pipes ---
[INFO] Deleting <https://builds.apache.org/job/Hama-Nightly-for-Hadoop-1.x/ws/trunk/c++>
(includes = [lib/**, logs/**, docs/apidocs/**, c++/src/CMakeCache.txt, c++/src/CMakeFiles/,
c++/src/Makefile, c++/src/cmake_install.cmake, c++/src/examples/], excludes = [])
[INFO] 
[INFO] --- maven-remote-resources-plugin:1.1:process (default) @ hama-pipes ---
[INFO] 
[INFO] --- maven-antrun-plugin:1.7:run (make) @ hama-pipes ---
[INFO] Executing tasks

main:
    [mkdir] Created dir: <https://builds.apache.org/job/Hama-Nightly-for-Hadoop-1.x/ws/trunk/c++/target/native>
     [exec] -- The C compiler identification is GNU
     [exec] -- The CXX compiler identification is GNU
     [exec] -- Check for working C compiler: /usr/bin/gcc
     [exec] -- Check for working C compiler: /usr/bin/gcc -- works
     [exec] -- Detecting C compiler ABI info
     [exec] -- Detecting C compiler ABI info - done
     [exec] -- Check for working CXX compiler: /usr/bin/c++
     [exec] -- Check for working CXX compiler: /usr/bin/c++ -- works
     [exec] -- Detecting CXX compiler ABI info
     [exec] -- Detecting CXX compiler ABI info - done
     [exec] -- Configuring done
     [exec] JAVA_HOME=, JAVA_JVM_LIBRARY=/home/hudson/tools/java/latest1.7/jre/lib/i386/client/libjvm.so
     [exec] JAVA_INCLUDE_PATH=/home/hudson/tools/java/latest1.7/include, JAVA_INCLUDE_PATH2=/home/hudson/tools/java/latest1.7/include/linux
     [exec] Located all JNI components successfully.
     [exec] -- Generating done
     [exec] -- Build files have been written to: <https://builds.apache.org/job/Hama-Nightly-for-Hadoop-1.x/ws/trunk/c++/target/native>
     [exec] /usr/bin/cmake -H<https://builds.apache.org/job/Hama-Nightly-for-Hadoop-1.x/ws/trunk/c++/src>
-B<https://builds.apache.org/job/Hama-Nightly-for-Hadoop-1.x/ws/trunk/c++/target/native>
--check-build-system CMakeFiles/Makefile.cmake 0
     [exec] /usr/bin/cmake -E cmake_progress_start <https://builds.apache.org/job/Hama-Nightly-for-Hadoop-1.x/ws/trunk/c++/target/native/CMakeFiles>
<https://builds.apache.org/job/Hama-Nightly-for-Hadoop-1.x/ws/trunk/c++/target/native/CMakeFiles/progress.marks>
     [exec] make -f CMakeFiles/Makefile2 all
     [exec] make[1]: Entering directory `<https://builds.apache.org/job/Hama-Nightly-for-Hadoop-1.x/ws/trunk/c++/target/native'>
     [exec] make -f CMakeFiles/DenseDoubleVector.dir/build.make CMakeFiles/DenseDoubleVector.dir/depend
     [exec] make[2]: Entering directory `<https://builds.apache.org/job/Hama-Nightly-for-Hadoop-1.x/ws/trunk/c++/target/native'>
     [exec] cd <https://builds.apache.org/job/Hama-Nightly-for-Hadoop-1.x/ws/trunk/c++/target/native>
&& /usr/bin/cmake -E cmake_depends "Unix Makefiles" <https://builds.apache.org/job/Hama-Nightly-for-Hadoop-1.x/ws/trunk/c++/src>
<https://builds.apache.org/job/Hama-Nightly-for-Hadoop-1.x/ws/trunk/c++/src> <https://builds.apache.org/job/Hama-Nightly-for-Hadoop-1.x/ws/trunk/c++/target/native>
<https://builds.apache.org/job/Hama-Nightly-for-Hadoop-1.x/ws/trunk/c++/target/native>
<https://builds.apache.org/job/Hama-Nightly-for-Hadoop-1.x/ws/trunk/c++/target/native/CMakeFiles/DenseDoubleVector.dir/DependInfo.cmake>
--color=
     [exec] Dependee "<https://builds.apache.org/job/Hama-Nightly-for-Hadoop-1.x/ws/trunk/c++/target/native/CMakeFiles/DenseDoubleVector.dir/DependInfo.cmake">
is newer than depender "<https://builds.apache.org/job/Hama-Nightly-for-Hadoop-1.x/ws/trunk/c++/target/native/CMakeFiles/DenseDoubleVector.dir/depend.internal".>
     [exec] Dependee "<https://builds.apache.org/job/Hama-Nightly-for-Hadoop-1.x/ws/trunk/c++/target/native/CMakeFiles/CMakeDirectoryInformation.cmake">
is newer than depender "<https://builds.apache.org/job/Hama-Nightly-for-Hadoop-1.x/ws/trunk/c++/target/native/CMakeFiles/DenseDoubleVector.dir/depend.internal".>
     [exec] Scanning dependencies of target DenseDoubleVector
     [exec] make[2]: Leaving directory `<https://builds.apache.org/job/Hama-Nightly-for-Hadoop-1.x/ws/trunk/c++/target/native'>
     [exec] make -f CMakeFiles/DenseDoubleVector.dir/build.make CMakeFiles/DenseDoubleVector.dir/build
     [exec] make[2]: Entering directory `<https://builds.apache.org/job/Hama-Nightly-for-Hadoop-1.x/ws/trunk/c++/target/native'>
     [exec] /usr/bin/cmake -E cmake_progress_report <https://builds.apache.org/job/Hama-Nightly-for-Hadoop-1.x/ws/trunk/c++/target/native/CMakeFiles>
1
     [exec] [ 14%] Building CXX object CMakeFiles/DenseDoubleVector.dir/main/native/examples/impl/DenseDoubleVector.cc.o
     [exec] /usr/bin/c++    -g -Wall -O2 -D_REENTRANT -D_GNU_SOURCE -D_LARGEFILE_SOURCE -D_FILE_OFFSET_BITS=64
-m32 -I<https://builds.apache.org/job/Hama-Nightly-for-Hadoop-1.x/ws/trunk/c++/src/main/native/utils/api>
-I<https://builds.apache.org/job/Hama-Nightly-for-Hadoop-1.x/ws/trunk/c++/src/main/native/pipes/api>
-I<https://builds.apache.org/job/Hama-Nightly-for-Hadoop-1.x/ws/trunk/c++/src>    -o
CMakeFiles/DenseDoubleVector.dir/main/native/examples/impl/DenseDoubleVector.cc.o -c <https://builds.apache.org/job/Hama-Nightly-for-Hadoop-1.x/ws/trunk/c++/src/main/native/examples/impl/DenseDoubleVector.cc>
     [exec] Linking CXX static library libDenseDoubleVector.a
     [exec] /usr/bin/cmake -P CMakeFiles/DenseDoubleVector.dir/cmake_clean_target.cmake
     [exec] /usr/bin/cmake -E cmake_link_script CMakeFiles/DenseDoubleVector.dir/link.txt
--verbose=1
     [exec] /usr/bin/ar cr libDenseDoubleVector.a  CMakeFiles/DenseDoubleVector.dir/main/native/examples/impl/DenseDoubleVector.cc.o
     [exec] /usr/bin/ranlib libDenseDoubleVector.a
     [exec] make[2]: Leaving directory `<https://builds.apache.org/job/Hama-Nightly-for-Hadoop-1.x/ws/trunk/c++/target/native'>
     [exec] /usr/bin/cmake -E cmake_progress_report <https://builds.apache.org/job/Hama-Nightly-for-Hadoop-1.x/ws/trunk/c++/target/native/CMakeFiles>
 1
     [exec] [ 14%] Built target DenseDoubleVector
     [exec] make -f CMakeFiles/hadooputils.dir/build.make CMakeFiles/hadooputils.dir/depend
     [exec] make[2]: Entering directory `<https://builds.apache.org/job/Hama-Nightly-for-Hadoop-1.x/ws/trunk/c++/target/native'>
     [exec] cd <https://builds.apache.org/job/Hama-Nightly-for-Hadoop-1.x/ws/trunk/c++/target/native>
&& /usr/bin/cmake -E cmake_depends "Unix Makefiles" <https://builds.apache.org/job/Hama-Nightly-for-Hadoop-1.x/ws/trunk/c++/src>
<https://builds.apache.org/job/Hama-Nightly-for-Hadoop-1.x/ws/trunk/c++/src> <https://builds.apache.org/job/Hama-Nightly-for-Hadoop-1.x/ws/trunk/c++/target/native>
<https://builds.apache.org/job/Hama-Nightly-for-Hadoop-1.x/ws/trunk/c++/target/native>
<https://builds.apache.org/job/Hama-Nightly-for-Hadoop-1.x/ws/trunk/c++/target/native/CMakeFiles/hadooputils.dir/DependInfo.cmake>
--color=
     [exec] Dependee "<https://builds.apache.org/job/Hama-Nightly-for-Hadoop-1.x/ws/trunk/c++/target/native/CMakeFiles/hadooputils.dir/DependInfo.cmake">
is newer than depender "<https://builds.apache.org/job/Hama-Nightly-for-Hadoop-1.x/ws/trunk/c++/target/native/CMakeFiles/hadooputils.dir/depend.internal".>
     [exec] Dependee "<https://builds.apache.org/job/Hama-Nightly-for-Hadoop-1.x/ws/trunk/c++/target/native/CMakeFiles/CMakeDirectoryInformation.cmake">
is newer than depender "<https://builds.apache.org/job/Hama-Nightly-for-Hadoop-1.x/ws/trunk/c++/target/native/CMakeFiles/hadooputils.dir/depend.internal".>
     [exec] Scanning dependencies of target hadooputils
     [exec] make[2]: Leaving directory `<https://builds.apache.org/job/Hama-Nightly-for-Hadoop-1.x/ws/trunk/c++/target/native'>
     [exec] make -f CMakeFiles/hadooputils.dir/build.make CMakeFiles/hadooputils.dir/build
     [exec] make[2]: Entering directory `<https://builds.apache.org/job/Hama-Nightly-for-Hadoop-1.x/ws/trunk/c++/target/native'>
     [exec] /usr/bin/cmake -E cmake_progress_report <https://builds.apache.org/job/Hama-Nightly-for-Hadoop-1.x/ws/trunk/c++/target/native/CMakeFiles>
2
     [exec] [ 28%] Building CXX object CMakeFiles/hadooputils.dir/main/native/utils/impl/StringUtils.cc.o
     [exec] /usr/bin/c++    -g -Wall -O2 -D_REENTRANT -D_GNU_SOURCE -D_LARGEFILE_SOURCE -D_FILE_OFFSET_BITS=64
-m32 -I<https://builds.apache.org/job/Hama-Nightly-for-Hadoop-1.x/ws/trunk/c++/src/main/native/utils/api>
-I<https://builds.apache.org/job/Hama-Nightly-for-Hadoop-1.x/ws/trunk/c++/src/main/native/pipes/api>
-I<https://builds.apache.org/job/Hama-Nightly-for-Hadoop-1.x/ws/trunk/c++/src>    -o
CMakeFiles/hadooputils.dir/main/native/utils/impl/StringUtils.cc.o -c <https://builds.apache.org/job/Hama-Nightly-for-Hadoop-1.x/ws/trunk/c++/src/main/native/utils/impl/StringUtils.cc>
     [exec] /usr/bin/cmake -E cmake_progress_report <https://builds.apache.org/job/Hama-Nightly-for-Hadoop-1.x/ws/trunk/c++/target/native/CMakeFiles>
3
     [exec] [ 42%] Building CXX object CMakeFiles/hadooputils.dir/main/native/utils/impl/Splitter.cc.o
     [exec] /usr/bin/c++    -g -Wall -O2 -D_REENTRANT -D_GNU_SOURCE -D_LARGEFILE_SOURCE -D_FILE_OFFSET_BITS=64
-m32 -I<https://builds.apache.org/job/Hama-Nightly-for-Hadoop-1.x/ws/trunk/c++/src/main/native/utils/api>
-I<https://builds.apache.org/job/Hama-Nightly-for-Hadoop-1.x/ws/trunk/c++/src/main/native/pipes/api>
-I<https://builds.apache.org/job/Hama-Nightly-for-Hadoop-1.x/ws/trunk/c++/src>    -o
CMakeFiles/hadooputils.dir/main/native/utils/impl/Splitter.cc.o -c <https://builds.apache.org/job/Hama-Nightly-for-Hadoop-1.x/ws/trunk/c++/src/main/native/utils/impl/Splitter.cc>
     [exec] /usr/bin/cmake -E cmake_progress_report <https://builds.apache.org/job/Hama-Nightly-for-Hadoop-1.x/ws/trunk/c++/target/native/CMakeFiles>
4
     [exec] [ 57%] Building CXX object CMakeFiles/hadooputils.dir/main/native/utils/impl/SerialUtils.cc.o
     [exec] /usr/bin/c++    -g -Wall -O2 -D_REENTRANT -D_GNU_SOURCE -D_LARGEFILE_SOURCE -D_FILE_OFFSET_BITS=64
-m32 -I<https://builds.apache.org/job/Hama-Nightly-for-Hadoop-1.x/ws/trunk/c++/src/main/native/utils/api>
-I<https://builds.apache.org/job/Hama-Nightly-for-Hadoop-1.x/ws/trunk/c++/src/main/native/pipes/api>
-I<https://builds.apache.org/job/Hama-Nightly-for-Hadoop-1.x/ws/trunk/c++/src>    -o
CMakeFiles/hadooputils.dir/main/native/utils/impl/SerialUtils.cc.o -c <https://builds.apache.org/job/Hama-Nightly-for-Hadoop-1.x/ws/trunk/c++/src/main/native/utils/impl/SerialUtils.cc>
     [exec] Linking CXX static library libhadooputils.a
     [exec] /usr/bin/cmake -P CMakeFiles/hadooputils.dir/cmake_clean_target.cmake
     [exec] /usr/bin/cmake -E cmake_link_script CMakeFiles/hadooputils.dir/link.txt --verbose=1
     [exec] /usr/bin/ar cr libhadooputils.a  CMakeFiles/hadooputils.dir/main/native/utils/impl/StringUtils.cc.o
CMakeFiles/hadooputils.dir/main/native/utils/impl/Splitter.cc.o CMakeFiles/hadooputils.dir/main/native/utils/impl/SerialUtils.cc.o
     [exec] /usr/bin/ranlib libhadooputils.a
     [exec] make[2]: Leaving directory `<https://builds.apache.org/job/Hama-Nightly-for-Hadoop-1.x/ws/trunk/c++/target/native'>
     [exec] /usr/bin/cmake -E cmake_progress_report <https://builds.apache.org/job/Hama-Nightly-for-Hadoop-1.x/ws/trunk/c++/target/native/CMakeFiles>
 2 3 4
     [exec] [ 57%] Built target hadooputils
     [exec] make -f CMakeFiles/matrixmultiplication.dir/build.make CMakeFiles/matrixmultiplication.dir/depend
     [exec] make[2]: Entering directory `<https://builds.apache.org/job/Hama-Nightly-for-Hadoop-1.x/ws/trunk/c++/target/native'>
     [exec] cd <https://builds.apache.org/job/Hama-Nightly-for-Hadoop-1.x/ws/trunk/c++/target/native>
&& /usr/bin/cmake -E cmake_depends "Unix Makefiles" <https://builds.apache.org/job/Hama-Nightly-for-Hadoop-1.x/ws/trunk/c++/src>
<https://builds.apache.org/job/Hama-Nightly-for-Hadoop-1.x/ws/trunk/c++/src> <https://builds.apache.org/job/Hama-Nightly-for-Hadoop-1.x/ws/trunk/c++/target/native>
<https://builds.apache.org/job/Hama-Nightly-for-Hadoop-1.x/ws/trunk/c++/target/native>
<https://builds.apache.org/job/Hama-Nightly-for-Hadoop-1.x/ws/trunk/c++/target/native/CMakeFiles/matrixmultiplication.dir/DependInfo.cmake>
--color=
     [exec] Dependee "<https://builds.apache.org/job/Hama-Nightly-for-Hadoop-1.x/ws/trunk/c++/target/native/CMakeFiles/matrixmultiplication.dir/DependInfo.cmake">
is newer than depender "<https://builds.apache.org/job/Hama-Nightly-for-Hadoop-1.x/ws/trunk/c++/target/native/CMakeFiles/matrixmultiplication.dir/depend.internal".>
     [exec] Dependee "<https://builds.apache.org/job/Hama-Nightly-for-Hadoop-1.x/ws/trunk/c++/target/native/CMakeFiles/CMakeDirectoryInformation.cmake">
is newer than depender "<https://builds.apache.org/job/Hama-Nightly-for-Hadoop-1.x/ws/trunk/c++/target/native/CMakeFiles/matrixmultiplication.dir/depend.internal".>
     [exec] Scanning dependencies of target matrixmultiplication
     [exec] make[2]: Leaving directory `<https://builds.apache.org/job/Hama-Nightly-for-Hadoop-1.x/ws/trunk/c++/target/native'>
     [exec] make -f CMakeFiles/matrixmultiplication.dir/build.make CMakeFiles/matrixmultiplication.dir/build
     [exec] make[2]: Entering directory `<https://builds.apache.org/job/Hama-Nightly-for-Hadoop-1.x/ws/trunk/c++/target/native'>
     [exec] /usr/bin/cmake -E cmake_progress_report <https://builds.apache.org/job/Hama-Nightly-for-Hadoop-1.x/ws/trunk/c++/target/native/CMakeFiles>
5
     [exec] [ 71%] Building CXX object CMakeFiles/matrixmultiplication.dir/main/native/examples/impl/matrixmultiplication.cc.o
     [exec] /usr/bin/c++    -g -Wall -O2 -D_REENTRANT -D_GNU_SOURCE -D_LARGEFILE_SOURCE -D_FILE_OFFSET_BITS=64
-m32 -I<https://builds.apache.org/job/Hama-Nightly-for-Hadoop-1.x/ws/trunk/c++/src/main/native/utils/api>
-I<https://builds.apache.org/job/Hama-Nightly-for-Hadoop-1.x/ws/trunk/c++/src/main/native/pipes/api>
-I<https://builds.apache.org/job/Hama-Nightly-for-Hadoop-1.x/ws/trunk/c++/src>    -o
CMakeFiles/matrixmultiplication.dir/main/native/examples/impl/matrixmultiplication.cc.o -c
<https://builds.apache.org/job/Hama-Nightly-for-Hadoop-1.x/ws/trunk/c++/src/main/native/examples/impl/matrixmultiplication.cc>
     [exec] Linking CXX executable examples/matrixmultiplication
     [exec] /usr/bin/cmake -E cmake_link_script CMakeFiles/matrixmultiplication.dir/link.txt
--verbose=1
     [exec] /usr/bin/c++    -g -Wall -O2 -D_REENTRANT -D_GNU_SOURCE -D_LARGEFILE_SOURCE -D_FILE_OFFSET_BITS=64
-m32    CMakeFiles/matrixmultiplication.dir/main/native/examples/impl/matrixmultiplication.cc.o
 -o examples/matrixmultiplication -rdynamic libDenseDoubleVector.a libhadooputils.a 
     [exec] make[2]: Leaving directory `<https://builds.apache.org/job/Hama-Nightly-for-Hadoop-1.x/ws/trunk/c++/target/native'>
     [exec] /usr/bin/cmake -E cmake_progress_report <https://builds.apache.org/job/Hama-Nightly-for-Hadoop-1.x/ws/trunk/c++/target/native/CMakeFiles>
 5
     [exec] [ 71%] Built target matrixmultiplication
     [exec] make -f CMakeFiles/piestimator.dir/build.make CMakeFiles/piestimator.dir/depend
     [exec] make[2]: Entering directory `<https://builds.apache.org/job/Hama-Nightly-for-Hadoop-1.x/ws/trunk/c++/target/native'>
     [exec] cd <https://builds.apache.org/job/Hama-Nightly-for-Hadoop-1.x/ws/trunk/c++/target/native>
&& /usr/bin/cmake -E cmake_depends "Unix Makefiles" <https://builds.apache.org/job/Hama-Nightly-for-Hadoop-1.x/ws/trunk/c++/src>
<https://builds.apache.org/job/Hama-Nightly-for-Hadoop-1.x/ws/trunk/c++/src> <https://builds.apache.org/job/Hama-Nightly-for-Hadoop-1.x/ws/trunk/c++/target/native>
<https://builds.apache.org/job/Hama-Nightly-for-Hadoop-1.x/ws/trunk/c++/target/native>
<https://builds.apache.org/job/Hama-Nightly-for-Hadoop-1.x/ws/trunk/c++/target/native/CMakeFiles/piestimator.dir/DependInfo.cmake>
--color=
     [exec] Dependee "<https://builds.apache.org/job/Hama-Nightly-for-Hadoop-1.x/ws/trunk/c++/target/native/CMakeFiles/piestimator.dir/DependInfo.cmake">
is newer than depender "<https://builds.apache.org/job/Hama-Nightly-for-Hadoop-1.x/ws/trunk/c++/target/native/CMakeFiles/piestimator.dir/depend.internal".>
     [exec] Dependee "<https://builds.apache.org/job/Hama-Nightly-for-Hadoop-1.x/ws/trunk/c++/target/native/CMakeFiles/CMakeDirectoryInformation.cmake">
is newer than depender "<https://builds.apache.org/job/Hama-Nightly-for-Hadoop-1.x/ws/trunk/c++/target/native/CMakeFiles/piestimator.dir/depend.internal".>
     [exec] Scanning dependencies of target piestimator
     [exec] make[2]: Leaving directory `<https://builds.apache.org/job/Hama-Nightly-for-Hadoop-1.x/ws/trunk/c++/target/native'>
     [exec] make -f CMakeFiles/piestimator.dir/build.make CMakeFiles/piestimator.dir/build
     [exec] make[2]: Entering directory `<https://builds.apache.org/job/Hama-Nightly-for-Hadoop-1.x/ws/trunk/c++/target/native'>
     [exec] /usr/bin/cmake -E cmake_progress_report <https://builds.apache.org/job/Hama-Nightly-for-Hadoop-1.x/ws/trunk/c++/target/native/CMakeFiles>
6
     [exec] [ 85%] Building CXX object CMakeFiles/piestimator.dir/main/native/examples/impl/piestimator.cc.o
     [exec] /usr/bin/c++    -g -Wall -O2 -D_REENTRANT -D_GNU_SOURCE -D_LARGEFILE_SOURCE -D_FILE_OFFSET_BITS=64
-m32 -I<https://builds.apache.org/job/Hama-Nightly-for-Hadoop-1.x/ws/trunk/c++/src/main/native/utils/api>
-I<https://builds.apache.org/job/Hama-Nightly-for-Hadoop-1.x/ws/trunk/c++/src/main/native/pipes/api>
-I<https://builds.apache.org/job/Hama-Nightly-for-Hadoop-1.x/ws/trunk/c++/src>    -o
CMakeFiles/piestimator.dir/main/native/examples/impl/piestimator.cc.o -c <https://builds.apache.org/job/Hama-Nightly-for-Hadoop-1.x/ws/trunk/c++/src/main/native/examples/impl/piestimator.cc>
     [exec] Linking CXX executable examples/piestimator
     [exec] /usr/bin/cmake -E cmake_link_script CMakeFiles/piestimator.dir/link.txt --verbose=1
     [exec] /usr/bin/c++    -g -Wall -O2 -D_REENTRANT -D_GNU_SOURCE -D_LARGEFILE_SOURCE -D_FILE_OFFSET_BITS=64
-m32    CMakeFiles/piestimator.dir/main/native/examples/impl/piestimator.cc.o  -o examples/piestimator
-rdynamic libhadooputils.a 
     [exec] make[2]: Leaving directory `<https://builds.apache.org/job/Hama-Nightly-for-Hadoop-1.x/ws/trunk/c++/target/native'>
     [exec] /usr/bin/cmake -E cmake_progress_report <https://builds.apache.org/job/Hama-Nightly-for-Hadoop-1.x/ws/trunk/c++/target/native/CMakeFiles>
 6
     [exec] [ 85%] Built target piestimator
     [exec] make -f CMakeFiles/summation.dir/build.make CMakeFiles/summation.dir/depend
     [exec] make[2]: Entering directory `<https://builds.apache.org/job/Hama-Nightly-for-Hadoop-1.x/ws/trunk/c++/target/native'>
     [exec] cd <https://builds.apache.org/job/Hama-Nightly-for-Hadoop-1.x/ws/trunk/c++/target/native>
&& /usr/bin/cmake -E cmake_depends "Unix Makefiles" <https://builds.apache.org/job/Hama-Nightly-for-Hadoop-1.x/ws/trunk/c++/src>
<https://builds.apache.org/job/Hama-Nightly-for-Hadoop-1.x/ws/trunk/c++/src> <https://builds.apache.org/job/Hama-Nightly-for-Hadoop-1.x/ws/trunk/c++/target/native>
<https://builds.apache.org/job/Hama-Nightly-for-Hadoop-1.x/ws/trunk/c++/target/native>
<https://builds.apache.org/job/Hama-Nightly-for-Hadoop-1.x/ws/trunk/c++/target/native/CMakeFiles/summation.dir/DependInfo.cmake>
--color=
     [exec] Dependee "<https://builds.apache.org/job/Hama-Nightly-for-Hadoop-1.x/ws/trunk/c++/target/native/CMakeFiles/summation.dir/DependInfo.cmake">
is newer than depender "<https://builds.apache.org/job/Hama-Nightly-for-Hadoop-1.x/ws/trunk/c++/target/native/CMakeFiles/summation.dir/depend.internal".>
     [exec] Dependee "<https://builds.apache.org/job/Hama-Nightly-for-Hadoop-1.x/ws/trunk/c++/target/native/CMakeFiles/CMakeDirectoryInformation.cmake">
is newer than depender "<https://builds.apache.org/job/Hama-Nightly-for-Hadoop-1.x/ws/trunk/c++/target/native/CMakeFiles/summation.dir/depend.internal".>
     [exec] Scanning dependencies of target summation
     [exec] make[2]: Leaving directory `<https://builds.apache.org/job/Hama-Nightly-for-Hadoop-1.x/ws/trunk/c++/target/native'>
     [exec] make -f CMakeFiles/summation.dir/build.make CMakeFiles/summation.dir/build
     [exec] make[2]: Entering directory `<https://builds.apache.org/job/Hama-Nightly-for-Hadoop-1.x/ws/trunk/c++/target/native'>
     [exec] /usr/bin/cmake -E cmake_progress_report <https://builds.apache.org/job/Hama-Nightly-for-Hadoop-1.x/ws/trunk/c++/target/native/CMakeFiles>
7
     [exec] [100%] Building CXX object CMakeFiles/summation.dir/main/native/examples/impl/summation.cc.o
     [exec] /usr/bin/c++    -g -Wall -O2 -D_REENTRANT -D_GNU_SOURCE -D_LARGEFILE_SOURCE -D_FILE_OFFSET_BITS=64
-m32 -I<https://builds.apache.org/job/Hama-Nightly-for-Hadoop-1.x/ws/trunk/c++/src/main/native/utils/api>
-I<https://builds.apache.org/job/Hama-Nightly-for-Hadoop-1.x/ws/trunk/c++/src/main/native/pipes/api>
-I<https://builds.apache.org/job/Hama-Nightly-for-Hadoop-1.x/ws/trunk/c++/src>    -o
CMakeFiles/summation.dir/main/native/examples/impl/summation.cc.o -c <https://builds.apache.org/job/Hama-Nightly-for-Hadoop-1.x/ws/trunk/c++/src/main/native/examples/impl/summation.cc>
     [exec] Linking CXX executable examples/summation
     [exec] /usr/bin/cmake -E cmake_link_script CMakeFiles/summation.dir/link.txt --verbose=1
     [exec] /usr/bin/c++    -g -Wall -O2 -D_REENTRANT -D_GNU_SOURCE -D_LARGEFILE_SOURCE -D_FILE_OFFSET_BITS=64
-m32    CMakeFiles/summation.dir/main/native/examples/impl/summation.cc.o  -o examples/summation
-rdynamic libhadooputils.a 
     [exec] make[2]: Leaving directory `<https://builds.apache.org/job/Hama-Nightly-for-Hadoop-1.x/ws/trunk/c++/target/native'>
     [exec] /usr/bin/cmake -E cmake_progress_report <https://builds.apache.org/job/Hama-Nightly-for-Hadoop-1.x/ws/trunk/c++/target/native/CMakeFiles>
 7
     [exec] [100%] Built target summation
     [exec] make[1]: Leaving directory `<https://builds.apache.org/job/Hama-Nightly-for-Hadoop-1.x/ws/trunk/c++/target/native'>
     [exec] /usr/bin/cmake -E cmake_progress_start <https://builds.apache.org/job/Hama-Nightly-for-Hadoop-1.x/ws/trunk/c++/target/native/CMakeFiles>
0
     [exec] [ 14%] Built target DenseDoubleVector
     [exec] [ 57%] Built target hadooputils
     [exec] [ 71%] Built target matrixmultiplication
     [exec] [ 85%] Built target piestimator
     [exec] [100%] Built target summation
[INFO] Executed tasks
[INFO] 
[INFO] --- gmaven-plugin:1.0:execute (default) @ hama-pipes ---
[INFO] 
[INFO] --- apache-rat-plugin:0.10:check (default) @ hama-pipes ---
[INFO] 51 implicit excludes (use -debug for more details).
[INFO] Exclude: .idea/**
[INFO] Exclude: .git/**
[INFO] Exclude: .gitignore
[INFO] Exclude: **/.classpath/**
[INFO] Exclude: **/.project
[INFO] Exclude: **/*.iml
[INFO] Exclude: **/.settings/**
[INFO] Exclude: **/*.asc
[INFO] Exclude: **/dependency-reduced-pom.xml
[INFO] Exclude: **/logs/**
[INFO] Exclude: **/docs/**
[INFO] Exclude: CHANGES.txt
[INFO] Exclude: conf/groomservers
[INFO] Exclude: src/site/resources/files/hama-eclipse-formatter.xml
[INFO] Exclude: **/src/test/resources/*.properties
[INFO] Exclude: **dependency-reduced-pom.xml
[INFO] Exclude: **/src/test/resources/*.txt
[INFO] Exclude: **/target/**
[INFO] 22 resources included (use -debug for more details)
[INFO] Rat check: Summary of files. Unapproved: 0 unknown: 0 generated: 0 approved: 20 licence.
[INFO] 
[INFO] --- maven-javadoc-plugin:2.8.1:jar (default) @ hama-pipes ---
[INFO] Not executing Javadoc as the project is not a Java classpath-capable package
[INFO] 
[INFO] --- maven-install-plugin:2.3:install (default-install) @ hama-pipes ---
[INFO] Installing <https://builds.apache.org/job/Hama-Nightly-for-Hadoop-1.x/ws/trunk/c++/pom.xml>
to <https://builds.apache.org/job/Hama-Nightly-for-Hadoop-1.x/ws/.repository/org/apache/hama/hama-pipes/0.7.0-SNAPSHOT/hama-pipes-0.7.0-SNAPSHOT.pom>
[INFO]                                                                         
[INFO] ------------------------------------------------------------------------
[INFO] Building commons 0.7.0-SNAPSHOT
[INFO] ------------------------------------------------------------------------
[INFO] 
[INFO] --- maven-clean-plugin:2.4.1:clean (default-clean) @ hama-commons ---
[INFO] Deleting <https://builds.apache.org/job/Hama-Nightly-for-Hadoop-1.x/ws/trunk/commons>
(includes = [lib/**, logs/**, docs/apidocs/**, c++/src/CMakeCache.txt, c++/src/CMakeFiles/,
c++/src/Makefile, c++/src/cmake_install.cmake, c++/src/examples/], excludes = [])
[INFO] 
[INFO] --- maven-remote-resources-plugin:1.1:process (default) @ hama-commons ---
[INFO] 
[INFO] --- maven-resources-plugin:2.4:resources (default-resources) @ hama-commons ---
[INFO] Using 'UTF-8' encoding to copy filtered resources.
[INFO] skip non existing resourceDirectory <https://builds.apache.org/job/Hama-Nightly-for-Hadoop-1.x/ws/trunk/commons/src/main/resources>
[INFO] Copying 3 resources
[INFO] 
[INFO] --- maven-compiler-plugin:2.3.2:compile (default-compile) @ hama-commons ---
[INFO] Compiling 29 source files to <https://builds.apache.org/job/Hama-Nightly-for-Hadoop-1.x/ws/trunk/commons/target/classes>
[INFO] 
[INFO] --- maven-resources-plugin:2.4:testResources (default-testResources) @ hama-commons
---
[INFO] Using 'UTF-8' encoding to copy filtered resources.
[INFO] skip non existing resourceDirectory <https://builds.apache.org/job/Hama-Nightly-for-Hadoop-1.x/ws/trunk/commons/src/test/resources>
[INFO] Copying 3 resources
[INFO] 
[INFO] --- maven-compiler-plugin:2.3.2:testCompile (default-testCompile) @ hama-commons ---
[INFO] Compiling 3 source files to <https://builds.apache.org/job/Hama-Nightly-for-Hadoop-1.x/ws/trunk/commons/target/test-classes>
[INFO] 
[INFO] --- maven-surefire-plugin:2.6:test (default-test) @ hama-commons ---
[INFO] Concurrency config is {threadCount=10, parallel=methods, configurableParallelComputerPresent=false}
[INFO] Surefire report directory: <https://builds.apache.org/job/Hama-Nightly-for-Hadoop-1.x/ws/trunk/commons/target/surefire-reports>

-------------------------------------------------------
 T E S T S
-------------------------------------------------------
Running org.apache.hama.commons.math.TestDenseDoubleVector
Tests run: 45, Failures: 0, Errors: 1, Skipped: 0, Time elapsed: 0.328 sec <<< FAILURE!
Running org.apache.hama.commons.math.TestFunctionFactory
Tests run: 2, Failures: 0, Errors: 0, Skipped: 0, Time elapsed: 0.018 sec
Running org.apache.hama.commons.math.TestDenseDoubleMatrix
Tests run: 14, Failures: 0, Errors: 0, Skipped: 0, Time elapsed: 0.046 sec

Results :

Tests in error: 

Tests run: 61, Failures: 0, Errors: 1, Skipped: 0

[INFO] ------------------------------------------------------------------------
[INFO] Reactor Summary:
[INFO] 
[INFO] Apache Hama parent POM ............................ SUCCESS [20.150s]
[INFO] pipes ............................................. SUCCESS [1:06.930s]
[INFO] commons ........................................... FAILURE [57.808s]
[INFO] core .............................................. SKIPPED
[INFO] graph ............................................. SKIPPED
[INFO] machine learning .................................. SKIPPED
[INFO] examples .......................................... SKIPPED
[INFO] hama-dist ......................................... SKIPPED
[INFO] ------------------------------------------------------------------------
[INFO] BUILD FAILURE
[INFO] ------------------------------------------------------------------------
[INFO] Total time: 2:28.308s
[INFO] Finished at: Tue Apr 01 00:09:19 UTC 2014
[INFO] Final Memory: 38M/258M
[INFO] ------------------------------------------------------------------------
[ERROR] Failed to execute goal org.apache.maven.plugins:maven-surefire-plugin:2.6:test (default-test)
on project hama-commons: There are test failures.
[ERROR] 
[ERROR] Please refer to <https://builds.apache.org/job/Hama-Nightly-for-Hadoop-1.x/ws/trunk/commons/target/surefire-reports>
for the individual test results.
[ERROR] -> [Help 1]
[ERROR] 
[ERROR] To see the full stack trace of the errors, re-run Maven with the -e switch.
[ERROR] Re-run Maven using the -X switch to enable full debug logging.
[ERROR] 
[ERROR] For more information about the errors and possible solutions, please read the following
articles:
[ERROR] [Help 1] http://cwiki.apache.org/confluence/display/MAVEN/MojoFailureException
[ERROR] 
[ERROR] After correcting the problems, you can resume the build with the command
[ERROR]   mvn <goals> -rf :hama-commons
Build step 'Invoke top-level Maven targets' marked build as failure
Archiving artifacts
Recording test results

Mime
View raw message