hama-dev mailing list archives

Site index · List index
Message view « Date » · « Thread »
Top « Date » · « Thread »
From Apache Jenkins Server <jenk...@builds.apache.org>
Subject Build failed in Jenkins: Hama-trunk #299
Date Fri, 11 Apr 2014 02:44:14 GMT
See <https://builds.apache.org/job/Hama-trunk/299/changes>

Changes:

[edwardyoon] HAMA-898: Add DOAP file

[yxjiang] HAMA-863: Implement SparseDoubleVector

------------------------------------------
[...truncated 105713 lines...]
[7.142013882031907, -4.129860794703656, 5.472041538621343, 4.862028388835388, 3.09601488571033,
-0.7899164074839112, -0.37198468063387413]	5.90827461359776
[7.134014199909772, -4.159858021315661, 5.462042086385522, 4.84802983631992, 3.0740168270731725,
-0.8159145003806193, -0.40598192743794786]	5.684788492460411
[7.126015107720446, -4.1898499010565375, 5.452043852379515, 4.834033565766788, 3.05202156320223,
-0.8419090545583884, -0.43997527682042126]	5.461339131380113
[7.11801733578837, -4.219829878769355, 5.442048280131357, 4.82004253196087, 3.0300328131581367,
-0.8678956887078861, -0.473959515179098]	5.23796853757739
[7.1100226297593, -4.2497822545565525, 5.432058851124702, 4.806063735799775, 3.0080593425992994,
-0.8938639300538058, -0.5079223665499674]	5.014778934940246
[7.10203508408036, -4.279670186149137, 5.422083748
402708, 4.792113564533352, 2.9861216440626746, -0.9197892138069559, -0.541835138835484]	4.792011704063929
[7.094064149371662, -4.309408625114272, 5.412141869325169, 4.778229824554746, 2.964266980841808,
-0.9456148394991056, -0.5756316615194502]	4.570228216084243
[7.086130978849286, -4.338807201271834, 5.402275517130851, 4.7644971285507856, 2.94260112270095,
-0.9712138933828114, -0.6091638550517424]	4.35070477467997
[7.078279787575417, -4.367467991903288, 5.392573118458076, 4.751092332714601, 2.9213451436250497,
-0.9963210944084716, -0.6421222134455117]	4.136204544458424
[7.070590165967807, -4.394674703108866, 5.383193849479623, 4.738333790121049, 2.900896989537819,
-1.0204589152235353, -0.6739496088942645]	3.9320992443258813
[7.063167338947803, -4.419480340330619, 5.374348153444877, 4.72664238634335, 2.881782773619096,
-1.0429960293855516, -0.7039094777967867]	3.746724152620719
[7.0560842347812, -4.441228589854085, 5.366181878052325, 4.716309814532597, 2.864367120496723,
-1.0634948990816013, -0.7314913386809223]	3.5882736744855825
[7.0560842347812, -4.441228589854085, 5.366181878052325, 4.716309814532597, 2.864367120496723,
-1.0634948990816013, -0.7314913386809223]	3.458803849984058

Job Finished in 3.235 seconds
Tests run: 1, Failures: 0, Errors: 0, Skipped: 0, Time elapsed: 0.009 sec
Running org.apache.hama.examples.BipartiteMatchingTest
14/04/11 02:43:47 WARN util.NativeCodeLoader: Unable to load native-hadoop library for your
platform... using builtin-java classes where applicable

14/04/11 02:43:47 INFO bsp.FileInputFormat: Total input paths to process : 1

14/04/11 02:43:47 WARN snappy.LoadSnappy: Snappy native library not loaded

14/04/11 02:43:47 INFO bsp.FileInputFormat: Total input paths to process : 1

14/04/11 02:43:47 WARN bsp.BSPJobClient: No job jar file set.  User classes may not be found.
See BSPJob#setJar(String) or check Your jar file.

14/04/11 02:43:47 INFO bsp.BSPJobClient: Running job: job_localrunner_0001

14/04/11 02:43:47 INFO bsp.LocalBSPRunner: Setting up a new barrier for 1 tasks!

14/04/11 02:43:50 INFO bsp.BSPJobClient: Current supersteps number: 1

14/04/11 02:43:50 INFO bsp.BSPJobClient: The total number of supersteps: 1

14/04/11 02:43:50 INFO bsp.BSPJobClient: Counters: 6

14/04/11 02:43:50 INFO bsp.BSPJobClient:   org.apache.hama.bsp.JobInProgress$JobCounter

14/04/11 02:43:50 INFO bsp.BSPJobClient:     SUPERSTEPS=1

14/04/11 02:43:50 INFO bsp.BSPJobClient:     LAUNCHED_TASKS=1

14/04/11 02:43:50 INFO bsp.BSPJobClient:   org.apache.hama.bsp.BSPPeerImpl$PeerCounter

14/04/11 02:43:50 INFO bsp.BSPJobClient:     SUPERSTEP_SUM=2

14/04/11 02:43:50 INFO bsp.BSPJobClient:     IO_BYTES_READ=28

14/04/11 02:43:50 INFO bsp.BSPJobClient:     TIME_IN_SYNC_MS=0

14/04/11 02:43:50 INFO bsp.BSPJobClient:     TASK_INPUT_RECORDS=4

14/04/11 02:43:50 INFO bsp.FileInputFormat: Total input paths to process : 2

14/04/11 02:43:50 WARN bsp.BSPJobClient: No job jar file set.  User classes may not be found.
See BSPJob#setJar(String) or check Your jar file.

14/04/11 02:43:50 INFO bsp.LocalBSPRunner: Setting up a new barrier for 2 tasks!

14/04/11 02:43:50 INFO bsp.BSPJobClient: Running job: job_localrunner_0001

14/04/11 02:43:50 INFO graph.GraphJobRunner: 2 vertices are loaded into local:0

14/04/11 02:43:50 INFO graph.GraphJobRunner: 2 vertices are loaded into local:1

14/04/11 02:43:53 INFO bsp.BSPJobClient: Current supersteps number: 30

14/04/11 02:43:53 INFO bsp.BSPJobClient: The total number of supersteps: 30

14/04/11 02:43:53 INFO bsp.BSPJobClient: Counters: 12

14/04/11 02:43:53 INFO bsp.BSPJobClient:   org.apache.hama.graph.GraphJobRunner$GraphJobCounter

14/04/11 02:43:53 INFO bsp.BSPJobClient:     ITERATIONS=30

14/04/11 02:43:53 INFO bsp.BSPJobClient:     INPUT_VERTICES=4

14/04/11 02:43:53 INFO bsp.BSPJobClient:   org.apache.hama.bsp.JobInProgress$JobCounter

14/04/11 02:43:53 INFO bsp.BSPJobClient:     SUPERSTEPS=30

14/04/11 02:43:53 INFO bsp.BSPJobClient:     LAUNCHED_TASKS=2

14/04/11 02:43:53 INFO bsp.BSPJobClient:   org.apache.hama.bsp.BSPPeerImpl$PeerCounter

14/04/11 02:43:53 INFO bsp.BSPJobClient:     SUPERSTEP_SUM=62

14/04/11 02:43:53 INFO bsp.BSPJobClient:     MESSAGE_BYTES_TRANSFERED=3605

14/04/11 02:43:53 INFO bsp.BSPJobClient:     IO_BYTES_READ=92

14/04/11 02:43:53 INFO bsp.BSPJobClient:     TIME_IN_SYNC_MS=32

14/04/11 02:43:53 INFO bsp.BSPJobClient:     TOTAL_MESSAGES_SENT=139

14/04/11 02:43:53 INFO bsp.BSPJobClient:     TASK_INPUT_RECORDS=4

14/04/11 02:43:53 INFO bsp.BSPJobClient:     TOTAL_MESSAGES_RECEIVED=135

14/04/11 02:43:53 INFO bsp.BSPJobClient:     TASK_OUTPUT_RECORDS=4

Job Finished in 6.335 seconds
A -> U L expvalue = B L
Tests run: 1, Failures: 1, Errors: 0, Skipped: 0, Time elapsed: 0.017 sec <<< FAILURE!
Running org.apache.hama.examples.SemiClusterMatchingTest
14/04/11 02:43:54 WARN util.NativeCodeLoader: Unable to load native-hadoop library for your
platform... using builtin-java classes where applicable

14/04/11 02:43:54 INFO bsp.FileInputFormat: Total input paths to process : 1

14/04/11 02:43:54 WARN snappy.LoadSnappy: Snappy native library not loaded

14/04/11 02:43:54 INFO bsp.FileInputFormat: Total input paths to process : 1

14/04/11 02:43:54 WARN bsp.BSPJobClient: No job jar file set.  User classes may not be found.
See BSPJob#setJar(String) or check Your jar file.

14/04/11 02:43:54 INFO bsp.BSPJobClient: Running job: job_localrunner_0001

14/04/11 02:43:54 INFO bsp.LocalBSPRunner: Setting up a new barrier for 1 tasks!

14/04/11 02:43:57 INFO bsp.BSPJobClient: Current supersteps number: 1

14/04/11 02:43:57 INFO bsp.BSPJobClient: The total number of supersteps: 1

14/04/11 02:43:57 INFO bsp.BSPJobClient: Counters: 6

14/04/11 02:43:57 INFO bsp.BSPJobClient:   org.apache.hama.bsp.JobInProgress$JobCounter

14/04/11 02:43:57 INFO bsp.BSPJobClient:     SUPERSTEPS=1

14/04/11 02:43:57 INFO bsp.BSPJobClient:     LAUNCHED_TASKS=1

14/04/11 02:43:57 INFO bsp.BSPJobClient:   org.apache.hama.bsp.BSPPeerImpl$PeerCounter

14/04/11 02:43:57 INFO bsp.BSPJobClient:     SUPERSTEP_SUM=2

14/04/11 02:43:57 INFO bsp.BSPJobClient:     IO_BYTES_READ=7189

14/04/11 02:43:57 INFO bsp.BSPJobClient:     TIME_IN_SYNC_MS=0

14/04/11 02:43:57 INFO bsp.BSPJobClient:     TASK_INPUT_RECORDS=100

14/04/11 02:43:57 INFO bsp.FileInputFormat: Total input paths to process : 3

14/04/11 02:43:57 WARN bsp.BSPJobClient: No job jar file set.  User classes may not be found.
See BSPJob#setJar(String) or check Your jar file.

14/04/11 02:43:57 INFO bsp.LocalBSPRunner: Setting up a new barrier for 3 tasks!

14/04/11 02:43:57 INFO bsp.BSPJobClient: Running job: job_localrunner_0001

14/04/11 02:43:58 INFO graph.GraphJobRunner: 33 vertices are loaded into local:0

14/04/11 02:43:58 INFO graph.GraphJobRunner: 33 vertices are loaded into local:2

14/04/11 02:43:58 INFO graph.GraphJobRunner: 34 vertices are loaded into local:1

14/04/11 02:44:00 INFO bsp.BSPJobClient: Current supersteps number: 6

14/04/11 02:44:03 INFO bsp.BSPJobClient: Current supersteps number: 15

14/04/11 02:44:03 INFO bsp.BSPJobClient: The total number of supersteps: 15

14/04/11 02:44:03 INFO bsp.BSPJobClient: Counters: 12

14/04/11 02:44:03 INFO bsp.BSPJobClient:   org.apache.hama.graph.GraphJobRunner$GraphJobCounter

14/04/11 02:44:03 INFO bsp.BSPJobClient:     ITERATIONS=15

14/04/11 02:44:03 INFO bsp.BSPJobClient:     INPUT_VERTICES=100

14/04/11 02:44:03 INFO bsp.BSPJobClient:   org.apache.hama.bsp.JobInProgress$JobCounter

14/04/11 02:44:03 INFO bsp.BSPJobClient:     SUPERSTEPS=15

14/04/11 02:44:03 INFO bsp.BSPJobClient:     LAUNCHED_TASKS=3

14/04/11 02:44:03 INFO bsp.BSPJobClient:   org.apache.hama.bsp.BSPPeerImpl$PeerCounter

14/04/11 02:44:03 INFO bsp.BSPJobClient:     SUPERSTEP_SUM=48

14/04/11 02:44:03 INFO bsp.BSPJobClient:     MESSAGE_BYTES_TRANSFERED=16947823

14/04/11 02:44:03 INFO bsp.BSPJobClient:     IO_BYTES_READ=8850

14/04/11 02:44:03 INFO bsp.BSPJobClient:     TIME_IN_SYNC_MS=1221

14/04/11 02:44:03 INFO bsp.BSPJobClient:     TOTAL_MESSAGES_SENT=166202

14/04/11 02:44:03 INFO bsp.BSPJobClient:     TASK_INPUT_RECORDS=100

14/04/11 02:44:03 INFO bsp.BSPJobClient:     TOTAL_MESSAGES_RECEIVED=155196

14/04/11 02:44:03 INFO bsp.BSPJobClient:     TASK_OUTPUT_RECORDS=100

Job Finished in 9.362 seconds
C1691 = [41, 44, 47, 42, 45, 48, 40, 43, 46, 49]
C1784 = [71, 74, 77, 72, 75, 78, 70, 73, 76, 79]
C1598 = [11, 14, 17, 12, 15, 18, 10, 13, 16, 19]
C1815 = [80, 83, 86, 89, 81, 84, 87, 82, 85, 88]
C1722 = [50, 53, 56, 59, 51, 54, 57, 52, 55, 58]
C79 = [2, 5, 8, 0, 3, 6, 9, 1, 4, 7]
C1753 = [62, 65, 68, 60, 63, 66, 69, 61, 64, 67]
C1846 = [92, 95, 98, 90, 93, 96, 99, 91, 94, 97]
C1629 = [20, 23, 26, 29, 21, 24, 27, 22, 25, 28]
C1660 = [32, 35, 38, 30, 33, 36, 39, 31, 34, 37]
Tests run: 1, Failures: 0, Errors: 0, Skipped: 0, Time elapsed: 0.008 sec

Results :

Failed tests: 

Tests run: 20, Failures: 1, Errors: 0, Skipped: 0

[INFO] ------------------------------------------------------------------------
[INFO] Reactor Summary:
[INFO] 
[INFO] Apache Hama parent POM ............................ SUCCESS [26.616s]
[INFO] pipes ............................................. SUCCESS [20.445s]
[INFO] commons ........................................... SUCCESS [9.848s]
[INFO] core .............................................. SUCCESS [3:10.213s]
[INFO] graph ............................................. SUCCESS [27.049s]
[INFO] machine learning .................................. SUCCESS [2:01.086s]
[INFO] examples .......................................... FAILURE [1:30.576s]
[INFO] hama-dist ......................................... SKIPPED
[INFO] ------------------------------------------------------------------------
[INFO] BUILD FAILURE
[INFO] ------------------------------------------------------------------------
[INFO] Total time: 8:06.655s
[INFO] Finished at: Fri Apr 11 02:44:04 UTC 2014
[INFO] Final Memory: 78M/172M
[INFO] ------------------------------------------------------------------------
[ERROR] Failed to execute goal org.apache.maven.plugins:maven-surefire-plugin:2.6:test (default-test)
on project hama-examples: There are test failures.
[ERROR] 
[ERROR] Please refer to <https://builds.apache.org/job/Hama-trunk/ws/trunk/examples/target/surefire-reports>
for the individual test results.
[ERROR] -> [Help 1]
[ERROR] 
[ERROR] To see the full stack trace of the errors, re-run Maven with the -e switch.
[ERROR] Re-run Maven using the -X switch to enable full debug logging.
[ERROR] 
[ERROR] For more information about the errors and possible solutions, please read the following
articles:
[ERROR] [Help 1] http://cwiki.apache.org/confluence/display/MAVEN/MojoFailureException
[ERROR] 
[ERROR] After correcting the problems, you can resume the build with the command
[ERROR]   mvn <goals> -rf :hama-examples
Build step 'Invoke top-level Maven targets' marked build as failure
Archiving artifacts
Recording test results
Updating HAMA-863
Updating HAMA-898

Mime
View raw message