hama-dev mailing list archives

Site index · List index
Message view « Date » · « Thread »
Top « Date » · « Thread »
From Apache Jenkins Server <jenk...@builds.apache.org>
Subject Build failed in Jenkins: Hama-Nightly-for-Hadoop-2.x #184
Date Sat, 22 Feb 2014 00:03:21 GMT
See <https://builds.apache.org/job/Hama-Nightly-for-Hadoop-2.x/184/changes>

Changes:

[edwardyoon] HAMA-874: The convertRecord() method should throw the Exception

------------------------------------------
[...truncated 12631 lines...]
Downloaded: http://repo.maven.apache.org/maven2/org/codehaus/plexus/plexus-i18n/1.0-beta-7/plexus-i18n-1.0-beta-7.jar
(11 KB at 1710.4 KB/sec)
Downloading: http://repo.maven.apache.org/maven2/org/codehaus/plexus/plexus-velocity/1.1.7/plexus-velocity-1.1.7.jar
                                                           
Downloaded: http://repo.maven.apache.org/maven2/org/apache/maven/doxia/doxia-module-fml/1.2/doxia-module-fml-1.2.jar
(37 KB at 4621.3 KB/sec)
Downloading: http://repo.maven.apache.org/maven2/org/apache/velocity/velocity/1.5/velocity-1.5.jar
                                                           
Downloaded: http://repo.maven.apache.org/maven2/xerces/xercesImpl/2.9.1/xercesImpl-2.9.1.jar
(1201 KB at 33342.1 KB/sec)
Downloading: http://repo.maven.apache.org/maven2/oro/oro/2.0.8/oro-2.0.8.jar
15/15 KB   3/8 KB   51/51 KB                               
15/15 KB   7/8 KB   51/51 KB   
15/15 KB   8/8 KB   51/51 KB   
15/15 KB   8/8 KB   51/51 KB   1/64 KB   
15/15 KB   8/8 KB   51/51 KB   5/64 KB   
15/15 KB   8/8 KB   51/51 KB   9/64 KB   
15/15 KB   8/8 KB   51/51 KB   13/64 KB   
15/15 KB   8/8 KB   3/383 KB   51/51 KB   13/64 KB   
15/15 KB   8/8 KB   3/383 KB   51/51 KB   17/64 KB   
15/15 KB   8/8 KB   3/383 KB   51/51 KB   21/64 KB   
15/15 KB   8/8 KB   7/383 KB   51/51 KB   21/64 KB   
15/15 KB   8/8 KB   7/383 KB   51/51 KB   25/64 KB   
15/15 KB   8/8 KB   11/383 KB   51/51 KB   25/64 KB   
15/15 KB   8/8 KB   11/383 KB   51/51 KB   29/64 KB   
15/15 KB   8/8 KB   15/383 KB   51/51 KB   29/64 KB   
15/15 KB   8/8 KB   15/383 KB   51/51 KB   33/64 KB   
15/15 KB   8/8 KB   19/383 KB   51/51 KB   33/64 KB   
15/15 KB   8/8 KB   19/383 KB   51/51 KB   37/64 KB   
15/15 KB   8/8 KB   23/383 KB   51/51 KB   37/64 KB   
15/15 KB   8/8 KB   23/383 KB   51/51 KB   41/64 KB   
15/15 KB   8/8 KB   27/383 KB   51/51 KB   41/64 KB   
15/15 KB   8/8 KB   27/383 KB   51/51 KB   45/64 KB   
15/15 KB   8/8 KB   31/383 KB   51/51 KB   45/64 KB   
15/15 KB   8/8 KB   31/383 KB   51/51 KB   49/64 KB   
                                                      
15/15 KB   34/383 KB   51/51 KB   49/64 KB            
15/15 KB   34/383 KB   51/51 KB   53/64 KB   
Downloaded: http://repo.maven.apache.org/maven2/org/codehaus/plexus/plexus-velocity/1.1.7/plexus-velocity-1.1.7.jar
(8 KB at 1248.0 KB/sec)
15/15 KB   37/383 KB   51/51 KB   53/64 KB   
Downloading: http://repo.maven.apache.org/maven2/org/apache/maven/reporting/maven-reporting-api/3.0/maven-reporting-api-3.0.jar
15/15 KB   37/383 KB   51/51 KB   57/64 KB   
15/15 KB   37/383 KB   51/51 KB   61/64 KB   
15/15 KB   37/383 KB   51/51 KB   64/64 KB   
15/15 KB   41/383 KB   51/51 KB   64/64 KB   
15/15 KB   45/383 KB   51/51 KB   64/64 KB   
15/15 KB   45/383 KB   51/51 KB   64/64 KB   
15/15 KB   49/383 KB   51/51 KB   64/64 KB   
15/15 KB   53/383 KB   51/51 KB   64/64 KB   
15/15 KB   57/383 KB   51/51 KB   64/64 KB   
15/15 KB   61/383 KB   51/51 KB   64/64 KB   
15/15 KB   65/383 KB   51/51 KB   64/64 KB   
15/15 KB   67/383 KB   51/51 KB   64/64 KB   
15/15 KB   71/383 KB   51/51 KB   64/64 KB   
15/15 KB   75/383 KB   51/51 KB   64/64 KB   
15/15 KB   79/383 KB   51/51 KB   64/64 KB   
15/15 KB   79/383 KB   51/51 KB   64/64 KB   
15/15 KB   83/383 KB   51/51 KB   64/64 KB   
15/15 KB   87/383 KB   51/51 KB   64/64 KB   
15/15 KB   91/383 KB   51/51 KB   64/64 KB   
15/15 KB   95/383 KB   51/51 KB   64/64 KB   
15/15 KB   99/383 KB   51/51 KB   64/64 KB   
15/15 KB   103/383 KB   51/51 KB   64/64 KB   
15/15 KB   107/383 KB   51/51 KB   64/64 KB   
15/15 KB   111/383 KB   51/51 KB   64/64 KB   
15/15 KB   111/383 KB   4/11 KB   51/51 KB   64/64 KB   
15/15 KB   113/383 KB   4/11 KB   51/51 KB   64/64 KB   
15/15 KB   113/383 KB   8/11 KB   51/51 KB   64/64 KB   
15/15 KB   113/383 KB   11/11 KB   51/51 KB   64/64 KB   
                                                         
Downloaded: http://repo.maven.apache.org/maven2/oro/oro/2.0.8/oro-2.0.8.jar (64 KB at 7966.4
KB/sec)
Downloading: http://repo.maven.apache.org/maven2/org/codehaus/plexus/plexus-utils/3.0.8/plexus-utils-3.0.8.jar
15/15 KB   117/383 KB   11/11 KB   51/51 KB              
15/15 KB   121/383 KB   11/11 KB   51/51 KB   
15/15 KB   125/383 KB   11/11 KB   51/51 KB   
15/15 KB   129/383 KB   11/11 KB   51/51 KB   
15/15 KB   133/383 KB   11/11 KB   51/51 KB   
15/15 KB   137/383 KB   11/11 KB   51/51 KB   
15/15 KB   141/383 KB   11/11 KB   51/51 KB   
15/15 KB   145/383 KB   11/11 KB   51/51 KB   
15/15 KB   147/383 KB   11/11 KB   51/51 KB   
15/15 KB   151/383 KB   11/11 KB   51/51 KB   
15/15 KB   155/383 KB   11/11 KB   51/51 KB   
15/15 KB   156/383 KB   11/11 KB   51/51 KB   
15/15 KB   160/383 KB   11/11 KB   51/51 KB   
15/15 KB   164/383 KB   11/11 KB   51/51 KB   
15/15 KB   167/383 KB   11/11 KB   51/51 KB   
15/15 KB   171/383 KB   11/11 KB   51/51 KB   
15/15 KB   175/383 KB   11/11 KB   51/51 KB   
15/15 KB   178/383 KB   11/11 KB   51/51 KB   
15/15 KB   181/383 KB   11/11 KB   51/51 KB   
15/15 KB   185/383 KB   11/11 KB   51/51 KB   
15/15 KB   185/383 KB   11/11 KB   51/51 KB   
                                              
15/15 KB   188/383 KB   51/51 KB              
Downloaded: http://repo.maven.apache.org/maven2/org/apache/maven/reporting/maven-reporting-api/3.0/maven-reporting-api-3.0.jar
(11 KB at 1780.6 KB/sec)
15/15 KB   190/383 KB   51/51 KB   
4/227 KB   15/15 KB   190/383 KB   51/51 KB   
4/227 KB   15/15 KB   191/383 KB   51/51 KB   
4/227 KB   15/15 KB   194/383 KB   51/51 KB   
4/227 KB   15/15 KB   198/383 KB   51/51 KB   
4/227 KB   15/15 KB   201/383 KB   51/51 KB   
4/227 KB   15/15 KB   202/383 KB   51/51 KB   
4/227 KB   15/15 KB   206/383 KB   51/51 KB   
4/227 KB   15/15 KB   210/383 KB   51/51 KB   
4/227 KB   15/15 KB   212/383 KB   51/51 KB   
4/227 KB   15/15 KB   214/383 KB   51/51 KB   
4/227 KB   15/15 KB   218/383 KB   51/51 KB   
4/227 KB   15/15 KB   222/383 KB   51/51 KB   
4/227 KB   15/15 KB   222/383 KB   51/51 KB   
4/227 KB   15/15 KB   224/383 KB   51/51 KB   
4/227 KB   15/15 KB   228/383 KB   51/51 KB   
4/227 KB   15/15 KB   228/383 KB   51/51 KB   
4/227 KB   15/15 KB   229/383 KB   51/51 KB   
4/227 KB   15/15 KB   233/383 KB   51/51 KB   
4/227 KB   15/15 KB   235/383 KB   51/51 KB   
4/227 KB   15/15 KB   239/383 KB   51/51 KB   
4/227 KB   15/15 KB   243/383 KB   51/51 KB   
4/227 KB   15/15 KB   247/383 KB   51/51 KB   
4/227 KB   15/15 KB   251/383 KB   51/51 KB   
4/227 KB   15/15 KB   255/383 KB   51/51 KB   
4/227 KB   15/15 KB   259/383 KB   51/51 KB   
4/227 KB   15/15 KB   262/383 KB   51/51 KB   
4/227 KB   15/15 KB   266/383 KB   51/51 KB   
4/227 KB   15/15 KB   267/383 KB   51/51 KB   
4/227 KB   15/15 KB   271/383 KB   51/51 KB   
4/227 KB   15/15 KB   275/383 KB   51/51 KB   
4/227 KB   15/15 KB   279/383 KB   51/51 KB   
4/227 KB   15/15 KB   282/383 KB   51/51 KB   
4/227 KB   15/15 KB   286/383 KB   51/51 KB   
4/227 KB   15/15 KB   290/383 KB   51/51 KB   
4/227 KB   15/15 KB   293/383 KB   51/51 KB   
4/227 KB   15/15 KB   297/383 KB   51/51 KB   
4/227 KB   15/15 KB   300/383 KB   51/51 KB   
4/227 KB   15/15 KB   304/383 KB   51/51 KB   
4/227 KB   15/15 KB   306/383 KB   51/51 KB   
4/227 KB   15/15 KB   310/383 KB   51/51 KB   
4/227 KB   15/15 KB   314/383 KB   51/51 KB   
4/227 KB   15/15 KB   315/383 KB   51/51 KB   
4/227 KB   15/15 KB   319/383 KB   51/51 KB   
4/227 KB   15/15 KB   323/383 KB   51/51 KB   
4/227 KB   15/15 KB   327/383 KB   51/51 KB   
4/227 KB   15/15 KB   331/383 KB   51/51 KB   
4/227 KB   15/15 KB   335/383 KB   51/51 KB   
4/227 KB   15/15 KB   338/383 KB   51/51 KB   
4/227 KB   15/15 KB   342/383 KB   51/51 KB   
4/227 KB   15/15 KB   344/383 KB   51/51 KB   
4/227 KB   15/15 KB   348/383 KB   51/51 KB   
4/227 KB   15/15 KB   352/383 KB   51/51 KB   
4/227 KB   15/15 KB   354/383 KB   51/51 KB   
4/227 KB   15/15 KB   358/383 KB   51/51 KB   
4/227 KB   15/15 KB   361/383 KB   51/51 KB   
4/227 KB   15/15 KB   365/383 KB   51/51 KB   
4/227 KB   15/15 KB   369/383 KB   51/51 KB   
4/227 KB   15/15 KB   372/383 KB   51/51 KB   
4/227 KB   15/15 KB   376/383 KB   51/51 KB   
4/227 KB   15/15 KB   376/383 KB   51/51 KB   
4/227 KB   15/15 KB   380/383 KB   51/51 KB   
4/227 KB   15/15 KB   383/383 KB   51/51 KB   
                                              
                                              
Downloaded: http://repo.maven.apache.org/maven2/org/apache/maven/doxia/doxia-site-renderer/1.2/doxia-site-renderer-1.2.jar
(51 KB at 1496.2 KB/sec)
Downloaded: http://repo.maven.apache.org/maven2/org/apache/maven/doxia/doxia-module-xhtml/1.2/doxia-module-xhtml-1.2.jar
(15 KB at 446.7 KB/sec)
8/227 KB   383/383 KB                         
12/227 KB   383/383 KB   
16/227 KB   383/383 KB   
20/227 KB   383/383 KB   
24/227 KB   383/383 KB   
28/227 KB   383/383 KB   
32/227 KB   383/383 KB   
36/227 KB   383/383 KB   
40/227 KB   383/383 KB   
44/227 KB   383/383 KB   
48/227 KB   383/383 KB   
52/227 KB   383/383 KB   
56/227 KB   383/383 KB   
60/227 KB   383/383 KB   
64/227 KB   383/383 KB   
68/227 KB   383/383 KB   
72/227 KB   383/383 KB   
76/227 KB   383/383 KB   
80/227 KB   383/383 KB   
84/227 KB   383/383 KB   
88/227 KB   383/383 KB   
92/227 KB   383/383 KB   
96/227 KB   383/383 KB   
100/227 KB   383/383 KB   
104/227 KB   383/383 KB   
108/227 KB   383/383 KB   
112/227 KB   383/383 KB   
116/227 KB   383/383 KB   
120/227 KB   383/383 KB   
124/227 KB   383/383 KB   
128/227 KB   383/383 KB   
132/227 KB   383/383 KB   
136/227 KB   383/383 KB   
140/227 KB   383/383 KB   
144/227 KB   383/383 KB   
148/227 KB   383/383 KB   
152/227 KB   383/383 KB   
156/227 KB   383/383 KB   
160/227 KB   383/383 KB   
164/227 KB   383/383 KB   
168/227 KB   383/383 KB   
172/227 KB   383/383 KB   
176/227 KB   383/383 KB   
180/227 KB   383/383 KB   
184/227 KB   383/383 KB   
188/227 KB   383/383 KB   
192/227 KB   383/383 KB   
196/227 KB   383/383 KB   
200/227 KB   383/383 KB   
204/227 KB   383/383 KB   
208/227 KB   383/383 KB   
212/227 KB   383/383 KB   
216/227 KB   383/383 KB   
220/227 KB   383/383 KB   
224/227 KB   383/383 KB   
227/227 KB   383/383 KB   
                          
Downloaded: http://repo.maven.apache.org/maven2/org/codehaus/plexus/plexus-utils/3.0.8/plexus-utils-3.0.8.jar
(227 KB at 9843.0 KB/sec)
                          
Downloaded: http://repo.maven.apache.org/maven2/org/apache/velocity/velocity/1.5/velocity-1.5.jar
(383 KB at 9573.3 KB/sec)
[INFO] ------------------------------------------------------------------------
[INFO] Reactor Summary:
[INFO] 
[INFO] Apache Hama parent POM ............................ FAILURE [21.166s]
[INFO] pipes ............................................. SKIPPED
[INFO] commons ........................................... SKIPPED
[INFO] core .............................................. SKIPPED
[INFO] graph ............................................. SKIPPED
[INFO] machine learning .................................. SKIPPED
[INFO] examples .......................................... SKIPPED
[INFO] hama-dist ......................................... SKIPPED
[INFO] ------------------------------------------------------------------------
[INFO] BUILD FAILURE
[INFO] ------------------------------------------------------------------------
[INFO] Total time: 22.526s
[INFO] Finished at: Sat Feb 22 00:03:19 UTC 2014
[INFO] Final Memory: 16M/222M
[INFO] ------------------------------------------------------------------------
[ERROR] Failed to execute goal org.apache.rat:apache-rat-plugin:0.10:check (default) on project
hama-parent: Execution default of goal org.apache.rat:apache-rat-plugin:0.10:check failed:
Plugin org.apache.rat:apache-rat-plugin:0.10 or one of its dependencies could not be resolved:
The following artifacts could not be resolved: commons-collections:commons-collections:jar:3.2.1,
commons-lang:commons-lang:jar:2.6, commons-cli:commons-cli:jar:1.2, commons-logging:commons-logging:jar:1.1.1:
Could not find artifact commons-collections:commons-collections:jar:3.2.1 -> [Help 1]
[ERROR] 
[ERROR] To see the full stack trace of the errors, re-run Maven with the -e switch.
[ERROR] Re-run Maven using the -X switch to enable full debug logging.
[ERROR] 
[ERROR] For more information about the errors and possible solutions, please read the following
articles:
[ERROR] [Help 1] http://cwiki.apache.org/confluence/display/MAVEN/PluginResolutionException
Build step 'Invoke top-level Maven targets' marked build as failure
Archiving artifacts
Recording test results
Updating HAMA-874

Mime
View raw message