hama-dev mailing list archives

Site index · List index
Message view « Date » · « Thread »
Top « Date » · « Thread »
From Apache Jenkins Server <jenk...@builds.apache.org>
Subject Build failed in Jenkins: Hama-Nightly-for-Hadoop-2.x #181
Date Tue, 18 Feb 2014 23:43:28 GMT
See <https://builds.apache.org/job/Hama-Nightly-for-Hadoop-2.x/181/changes>

Changes:

[edwardyoon] 

[edwardyoon] revert meaningless code changes.

[edwardyoon] HAMA-868: Fix SemiClustering bugs (edwardyoon)

------------------------------------------
[...truncated 12721 lines...]
51/51 KB   11/11 KB   11/15 KB   
51/51 KB   11/11 KB   15/15 KB   
51/51 KB   11/11 KB   15/15 KB   
                                 
Downloaded: http://repo.maven.apache.org/maven2/org/apache/maven/doxia/doxia-sink-api/1.2/doxia-sink-api-1.2.jar
(11 KB at 392.0 KB/sec)
Downloading: http://repo.maven.apache.org/maven2/org/codehaus/plexus/plexus-velocity/1.1.7/plexus-velocity-1.1.7.jar
51/51 KB   15/15 KB   4/37 KB    
51/51 KB   15/15 KB   7/37 KB   
51/51 KB   15/15 KB   11/37 KB   
51/51 KB   15/15 KB   15/37 KB   
51/51 KB   15/15 KB   19/37 KB   
51/51 KB   15/15 KB   23/37 KB   
51/51 KB   15/15 KB   27/37 KB   
51/51 KB   15/15 KB   31/37 KB   
51/51 KB   15/15 KB   35/37 KB   
51/51 KB   15/15 KB   37/37 KB   
                                 
Downloaded: http://repo.maven.apache.org/maven2/org/apache/maven/doxia/doxia-site-renderer/1.2/doxia-site-renderer-1.2.jar
(51 KB at 1884.1 KB/sec)
Downloading: http://repo.maven.apache.org/maven2/org/apache/velocity/velocity/1.5/velocity-1.5.jar
1/11 KB   15/15 KB   37/37 KB    
5/11 KB   15/15 KB   37/37 KB   
9/11 KB   15/15 KB   37/37 KB   
11/11 KB   15/15 KB   37/37 KB   
                                 
Downloaded: http://repo.maven.apache.org/maven2/org/apache/maven/doxia/doxia-module-xhtml/1.2/doxia-module-xhtml-1.2.jar
(15 KB at 567.0 KB/sec)
Downloading: http://repo.maven.apache.org/maven2/oro/oro/2.0.8/oro-2.0.8.jar
11/11 KB   4/8 KB   37/37 KB     
11/11 KB   8/8 KB   37/37 KB   
                               
Downloaded: http://repo.maven.apache.org/maven2/org/apache/maven/doxia/doxia-module-fml/1.2/doxia-module-fml-1.2.jar
(37 KB at 1369.3 KB/sec)
Downloading: http://repo.maven.apache.org/maven2/org/apache/maven/reporting/maven-reporting-api/3.0/maven-reporting-api-3.0.jar
                               
Downloaded: http://repo.maven.apache.org/maven2/org/codehaus/plexus/plexus-i18n/1.0-beta-7/plexus-i18n-1.0-beta-7.jar
(11 KB at 394.7 KB/sec)
Downloading: http://repo.maven.apache.org/maven2/org/codehaus/plexus/plexus-utils/3.0.8/plexus-utils-3.0.8.jar
2/383 KB   8/8 KB              
6/383 KB   8/8 KB   
10/383 KB   8/8 KB   
14/383 KB   8/8 KB   
18/383 KB   8/8 KB   
22/383 KB   8/8 KB   
26/383 KB   8/8 KB   
30/383 KB   8/8 KB   
34/383 KB   8/8 KB   
38/383 KB   8/8 KB   
42/383 KB   8/8 KB   
46/383 KB   8/8 KB   
50/383 KB   8/8 KB   
54/383 KB   8/8 KB   
58/383 KB   8/8 KB   
62/383 KB   8/8 KB   
66/383 KB   8/8 KB   
70/383 KB   8/8 KB   
74/383 KB   8/8 KB   
78/383 KB   8/8 KB   
82/383 KB   8/8 KB   
86/383 KB   8/8 KB   
90/383 KB   8/8 KB   
94/383 KB   8/8 KB   
98/383 KB   8/8 KB   
102/383 KB   8/8 KB   
106/383 KB   8/8 KB   
110/383 KB   8/8 KB   
114/383 KB   8/8 KB   
118/383 KB   8/8 KB   
122/383 KB   8/8 KB   
126/383 KB   8/8 KB   
130/383 KB   8/8 KB   
134/383 KB   8/8 KB   
138/383 KB   8/8 KB   
142/383 KB   8/8 KB   
146/383 KB   8/8 KB   
150/383 KB   8/8 KB   
154/383 KB   8/8 KB   
158/383 KB   8/8 KB   
162/383 KB   8/8 KB   
166/383 KB   8/8 KB   
170/383 KB   8/8 KB   
174/383 KB   8/8 KB   
178/383 KB   8/8 KB   
182/383 KB   8/8 KB   
186/383 KB   8/8 KB   
190/383 KB   8/8 KB   
194/383 KB   8/8 KB   
198/383 KB   8/8 KB   
202/383 KB   8/8 KB   
206/383 KB   8/8 KB   
210/383 KB   8/8 KB   
214/383 KB   8/8 KB   
218/383 KB   8/8 KB   
222/383 KB   8/8 KB   
226/383 KB   8/8 KB   
230/383 KB   8/8 KB   
234/383 KB   8/8 KB   
238/383 KB   8/8 KB   
242/383 KB   8/8 KB   
246/383 KB   8/8 KB   
250/383 KB   8/8 KB   
254/383 KB   8/8 KB   
258/383 KB   8/8 KB   
262/383 KB   8/8 KB   
266/383 KB   8/8 KB   
266/383 KB   4/64 KB   8/8 KB   
270/383 KB   4/64 KB   8/8 KB   
270/383 KB   8/64 KB   8/8 KB   
274/383 KB   8/64 KB   8/8 KB   
274/383 KB   12/64 KB   8/8 KB   
278/383 KB   12/64 KB   8/8 KB   
278/383 KB   16/64 KB   8/8 KB   
282/383 KB   16/64 KB   8/8 KB   
282/383 KB   20/64 KB   8/8 KB   
286/383 KB   20/64 KB   8/8 KB   
286/383 KB   24/64 KB   8/8 KB   
290/383 KB   24/64 KB   8/8 KB   
290/383 KB   28/64 KB   8/8 KB   
294/383 KB   28/64 KB   8/8 KB   
294/383 KB   32/64 KB   8/8 KB   
298/383 KB   32/64 KB   8/8 KB   
298/383 KB   36/64 KB   8/8 KB   
302/383 KB   36/64 KB   8/8 KB   
302/383 KB   40/64 KB   8/8 KB   
306/383 KB   40/64 KB   8/8 KB   
306/383 KB   44/64 KB   8/8 KB   
310/383 KB   44/64 KB   8/8 KB   
310/383 KB   48/64 KB   8/8 KB   
314/383 KB   48/64 KB   8/8 KB   
314/383 KB   52/64 KB   8/8 KB   
318/383 KB   52/64 KB   8/8 KB   
318/383 KB   56/64 KB   8/8 KB   
322/383 KB   56/64 KB   8/8 KB   
322/383 KB   60/64 KB   8/8 KB   
326/383 KB   60/64 KB   8/8 KB   
326/383 KB   64/64 KB   8/8 KB   
                                 
330/383 KB   64/64 KB            
Downloaded: http://repo.maven.apache.org/maven2/org/codehaus/plexus/plexus-velocity/1.1.7/plexus-velocity-1.1.7.jar
(8 KB at 258.2 KB/sec)
330/383 KB   64/64 KB   
334/383 KB   64/64 KB   
338/383 KB   64/64 KB   
342/383 KB   64/64 KB   
346/383 KB   64/64 KB   
350/383 KB   64/64 KB   
354/383 KB   64/64 KB   
358/383 KB   64/64 KB   
362/383 KB   64/64 KB   
366/383 KB   64/64 KB   
370/383 KB   64/64 KB   
374/383 KB   64/64 KB   
378/383 KB   64/64 KB   
382/383 KB   64/64 KB   
383/383 KB   64/64 KB   
3/11 KB   383/383 KB   64/64 KB   
7/11 KB   383/383 KB   64/64 KB   
11/11 KB   383/383 KB   64/64 KB   
11/11 KB   383/383 KB   64/64 KB   
4/227 KB   11/11 KB   383/383 KB   64/64 KB   
6/227 KB   11/11 KB   383/383 KB   64/64 KB   
10/227 KB   11/11 KB   383/383 KB   64/64 KB   
14/227 KB   11/11 KB   383/383 KB   64/64 KB   
18/227 KB   11/11 KB   383/383 KB   64/64 KB   
22/227 KB   11/11 KB   383/383 KB   64/64 KB   
26/227 KB   11/11 KB   383/383 KB   64/64 KB   
30/227 KB   11/11 KB   383/383 KB   64/64 KB   
34/227 KB   11/11 KB   383/383 KB   64/64 KB   
38/227 KB   11/11 KB   383/383 KB   64/64 KB   
42/227 KB   11/11 KB   383/383 KB   64/64 KB   
46/227 KB   11/11 KB   383/383 KB   64/64 KB   
50/227 KB   11/11 KB   383/383 KB   64/64 KB   
54/227 KB   11/11 KB   383/383 KB   64/64 KB   
58/227 KB   11/11 KB   383/383 KB   64/64 KB   
62/227 KB   11/11 KB   383/383 KB   64/64 KB   
66/227 KB   11/11 KB   383/383 KB   64/64 KB   
70/227 KB   11/11 KB   383/383 KB   64/64 KB   
74/227 KB   11/11 KB   383/383 KB   64/64 KB   
78/227 KB   11/11 KB   383/383 KB   64/64 KB   
82/227 KB   11/11 KB   383/383 KB   64/64 KB   
86/227 KB   11/11 KB   383/383 KB   64/64 KB   
90/227 KB   11/11 KB   383/383 KB   64/64 KB   
94/227 KB   11/11 KB   383/383 KB   64/64 KB   
98/227 KB   11/11 KB   383/383 KB   64/64 KB   
102/227 KB   11/11 KB   383/383 KB   64/64 KB   
106/227 KB   11/11 KB   383/383 KB   64/64 KB   
110/227 KB   11/11 KB   383/383 KB   64/64 KB   
114/227 KB   11/11 KB   383/383 KB   64/64 KB   
118/227 KB   11/11 KB   383/383 KB   64/64 KB   
122/227 KB   11/11 KB   383/383 KB   64/64 KB   
126/227 KB   11/11 KB   383/383 KB   64/64 KB   
130/227 KB   11/11 KB   383/383 KB   64/64 KB   
134/227 KB   11/11 KB   383/383 KB   64/64 KB   
                                                
138/227 KB   11/11 KB   383/383 KB              
142/227 KB   11/11 KB   383/383 KB   
Downloaded: http://repo.maven.apache.org/maven2/oro/oro/2.0.8/oro-2.0.8.jar (64 KB at 1874.5
KB/sec)
146/227 KB   11/11 KB   383/383 KB   
150/227 KB   11/11 KB   383/383 KB   
154/227 KB   11/11 KB   383/383 KB   
158/227 KB   11/11 KB   383/383 KB   
162/227 KB   11/11 KB   383/383 KB   
166/227 KB   11/11 KB   383/383 KB   
170/227 KB   11/11 KB   383/383 KB   
174/227 KB   11/11 KB   383/383 KB   
178/227 KB   11/11 KB   383/383 KB   
182/227 KB   11/11 KB   383/383 KB   
186/227 KB   11/11 KB   383/383 KB   
190/227 KB   11/11 KB   383/383 KB   
                                     
                                     
Downloaded: http://repo.maven.apache.org/maven2/org/apache/maven/reporting/maven-reporting-api/3.0/maven-reporting-api-3.0.jar
(11 KB at 395.7 KB/sec)
194/227 KB                           
198/227 KB   
202/227 KB   
206/227 KB   
210/227 KB   
214/227 KB   
218/227 KB   
222/227 KB   
226/227 KB   
227/227 KB   
Downloaded: http://repo.maven.apache.org/maven2/org/apache/velocity/velocity/1.5/velocity-1.5.jar
(383 KB at 10077.2 KB/sec)
             
Downloaded: http://repo.maven.apache.org/maven2/org/codehaus/plexus/plexus-utils/3.0.8/plexus-utils-3.0.8.jar
(227 KB at 5957.6 KB/sec)
[INFO] ------------------------------------------------------------------------
[INFO] Reactor Summary:
[INFO] 
[INFO] Apache Hama parent POM ............................ FAILURE [14.287s]
[INFO] pipes ............................................. SKIPPED
[INFO] commons ........................................... SKIPPED
[INFO] core .............................................. SKIPPED
[INFO] graph ............................................. SKIPPED
[INFO] machine learning .................................. SKIPPED
[INFO] examples .......................................... SKIPPED
[INFO] hama-dist ......................................... SKIPPED
[INFO] ------------------------------------------------------------------------
[INFO] BUILD FAILURE
[INFO] ------------------------------------------------------------------------
[INFO] Total time: 15.895s
[INFO] Finished at: Tue Feb 18 23:42:56 UTC 2014
[INFO] Final Memory: 15M/146M
[INFO] ------------------------------------------------------------------------
[ERROR] Failed to execute goal org.apache.rat:apache-rat-plugin:0.10:check (default) on project
hama-parent: Execution default of goal org.apache.rat:apache-rat-plugin:0.10:check failed:
Plugin org.apache.rat:apache-rat-plugin:0.10 or one of its dependencies could not be resolved:
The following artifacts could not be resolved: commons-collections:commons-collections:jar:3.2.1,
commons-lang:commons-lang:jar:2.6, commons-cli:commons-cli:jar:1.2, commons-logging:commons-logging:jar:1.1.1:
Could not find artifact commons-collections:commons-collections:jar:3.2.1 -> [Help 1]
[ERROR] 
[ERROR] To see the full stack trace of the errors, re-run Maven with the -e switch.
[ERROR] Re-run Maven using the -X switch to enable full debug logging.
[ERROR] 
[ERROR] For more information about the errors and possible solutions, please read the following
articles:
[ERROR] [Help 1] http://cwiki.apache.org/confluence/display/MAVEN/PluginResolutionException
Build step 'Invoke top-level Maven targets' marked build as failure
Archiving artifacts
Recording test results
Updating HAMA-868

Mime
View raw message