hama-dev mailing list archives

Site index · List index
Message view « Date » · « Thread »
Top « Date » · « Thread »
From Apache Jenkins Server <jenk...@builds.apache.org>
Subject Build failed in Jenkins: Hama-Nightly-for-Hadoop-1.x #1169
Date Tue, 04 Feb 2014 01:20:44 GMT
See <https://builds.apache.org/job/Hama-Nightly-for-Hadoop-1.x/1169/changes>

Changes:

[edwardyoon] Fix build fail

[yxjiang] remove cli2

[edwardyoon] Remove mahout dependency

[edwardyoon] HAMA-859: change the version of commons-cli

[edwardyoon] HAMA-862: Handling max tasks exception (edwardyoon)

------------------------------------------
[...truncated 4872 lines...]

14/02/04 01:20:19 INFO ipc.Server: Stopping server on 49097

14/02/04 01:20:19 INFO ipc.Server: Stopping IPC Server Responder

14/02/04 01:20:19 INFO ipc.Server: IPC Server handler 0 on 49097: exiting

14/02/04 01:20:19 INFO ipc.Server: IPC Server handler 1 on 49097: exiting

14/02/04 01:20:19 INFO ipc.Server: IPC Server handler 2 on 49097: exiting

14/02/04 01:20:19 INFO ipc.Server: IPC Server handler 3 on 49097: exiting

14/02/04 01:20:19 INFO ipc.Server: IPC Server handler 4 on 49097: exiting

14/02/04 01:20:19 INFO ipc.Server: Stopping IPC Server listener on 49097

14/02/04 01:20:19 INFO ipc.Server: Stopping IPC Server Responder

14/02/04 01:20:19 INFO server.NIOServerCnxnFactory: NIOServerCnxn factory exited run method

14/02/04 01:20:19 INFO server.ZooKeeperServer: shutting down

14/02/04 01:20:19 INFO server.SessionTrackerImpl: Shutting down

14/02/04 01:20:19 INFO server.PrepRequestProcessor: Shutting down

14/02/04 01:20:19 INFO server.SyncRequestProcessor: Shutting down

14/02/04 01:20:19 INFO server.PrepRequestProcessor: PrepRequestProcessor exited loop!

14/02/04 01:20:19 INFO server.SyncRequestProcessor: SyncRequestProcessor exited!

14/02/04 01:20:19 INFO server.FinalRequestProcessor: shutdown of request processor complete

Tests run: 1, Failures: 0, Errors: 0, Skipped: 0, Time elapsed: 0.017 sec
Running org.apache.hama.zookeeper.TestZKTools
Tests run: 1, Failures: 0, Errors: 0, Skipped: 0, Time elapsed: 0.013 sec
Running org.apache.hama.bsp.TestZooKeeper
14/02/04 01:20:21 ERROR quorum.QuorumPeerConfig: Invalid configuration, only one server specified
(ignoring)

14/02/04 01:20:21 INFO server.ZooKeeperServerMain: Starting server

14/02/04 01:20:21 INFO server.ZooKeeperServer: Server environment:zookeeper.version=3.4.5-1392090,
built on 09/30/2012 17:52 GMT

14/02/04 01:20:21 INFO server.ZooKeeperServer: Server environment:host.name=janus.apache.org

14/02/04 01:20:21 INFO server.ZooKeeperServer: Server environment:java.version=1.7.0_25

14/02/04 01:20:21 INFO server.ZooKeeperServer: Server environment:java.vendor=Oracle Corporation

14/02/04 01:20:21 INFO server.ZooKeeperServer: Server environment:java.home=/home/jenkins/tools/java/jdk1.7.0_25-32/jre

14/02/04 01:20:21 INFO server.ZooKeeperServer: Server environment:java.class.path=/tmp/surefirebooter4740591725441912589.jar

14/02/04 01:20:21 INFO server.ZooKeeperServer: Server environment:java.library.path=/usr/java/packages/lib/i386:/lib:/usr/lib

14/02/04 01:20:21 INFO server.ZooKeeperServer: Server environment:java.io.tmpdir=/tmp

14/02/04 01:20:21 INFO server.ZooKeeperServer: Server environment:java.compiler=<NA>

14/02/04 01:20:21 INFO server.ZooKeeperServer: Server environment:os.name=Linux

14/02/04 01:20:21 INFO server.ZooKeeperServer: Server environment:os.arch=i386

14/02/04 01:20:21 INFO server.ZooKeeperServer: Server environment:os.version=3.2.0-57-generic

14/02/04 01:20:21 INFO server.ZooKeeperServer: Server environment:user.name=jenkins

14/02/04 01:20:21 INFO server.ZooKeeperServer: Server environment:user.home=/home/jenkins

14/02/04 01:20:21 INFO server.ZooKeeperServer: Server environment:user.dir=/tmp

14/02/04 01:20:21 INFO server.ZooKeeperServer: tickTime set to 3000

14/02/04 01:20:21 INFO server.ZooKeeperServer: minSessionTimeout set to -1

14/02/04 01:20:21 INFO server.ZooKeeperServer: maxSessionTimeout set to 1200000

14/02/04 01:20:21 INFO server.NIOServerCnxnFactory: binding to port 0.0.0.0/0.0.0.0:20000

14/02/04 01:20:21 INFO persistence.FileSnap: Reading snapshot /tmp/hama-testzookeeper/version-2/snapshot.287

14/02/04 01:20:21 INFO persistence.FileTxnSnapLog: Snapshotting: 0x28c to /tmp/hama-testzookeeper/version-2/snapshot.28c

14/02/04 01:20:31 INFO zookeeper.ZooKeeper: Client environment:zookeeper.version=3.4.5-1392090,
built on 09/30/2012 17:52 GMT

14/02/04 01:20:31 INFO zookeeper.ZooKeeper: Client environment:host.name=janus.apache.org

14/02/04 01:20:31 INFO zookeeper.ZooKeeper: Client environment:java.version=1.7.0_25

14/02/04 01:20:31 INFO zookeeper.ZooKeeper: Client environment:java.vendor=Oracle Corporation

14/02/04 01:20:31 INFO zookeeper.ZooKeeper: Client environment:java.home=/home/jenkins/tools/java/jdk1.7.0_25-32/jre

14/02/04 01:20:31 INFO zookeeper.ZooKeeper: Client environment:java.class.path=/tmp/surefirebooter4740591725441912589.jar

14/02/04 01:20:31 INFO zookeeper.ZooKeeper: Client environment:java.library.path=/usr/java/packages/lib/i386:/lib:/usr/lib

14/02/04 01:20:31 INFO zookeeper.ZooKeeper: Client environment:java.io.tmpdir=/tmp

14/02/04 01:20:31 INFO zookeeper.ZooKeeper: Client environment:java.compiler=<NA>

14/02/04 01:20:31 INFO zookeeper.ZooKeeper: Client environment:os.name=Linux

14/02/04 01:20:31 INFO zookeeper.ZooKeeper: Client environment:os.arch=i386

14/02/04 01:20:31 INFO zookeeper.ZooKeeper: Client environment:os.version=3.2.0-57-generic

14/02/04 01:20:31 INFO zookeeper.ZooKeeper: Client environment:user.name=jenkins

14/02/04 01:20:31 INFO zookeeper.ZooKeeper: Client environment:user.home=/home/jenkins

14/02/04 01:20:31 INFO zookeeper.ZooKeeper: Client environment:user.dir=/tmp

14/02/04 01:20:31 INFO zookeeper.ZooKeeper: Initiating client connection, connectString=localhost:20000
sessionTimeout=1200000 watcher=org.apache.hama.bsp.sync.ZKSyncBSPMasterClient@4c24a2

14/02/04 01:20:31 INFO sync.ZKSyncBSPMasterClient: Initialized ZK false

14/02/04 01:20:31 INFO sync.ZKSyncClient: Initializing ZK Sync Client

14/02/04 01:20:31 INFO zookeeper.ClientCnxn: Opening socket connection to server localhost/127.0.0.1:20000.
Will not attempt to authenticate using SASL (unknown error)

14/02/04 01:20:31 INFO server.NIOServerCnxnFactory: Accepted socket connection from /127.0.0.1:46023

14/02/04 01:20:31 INFO zookeeper.ClientCnxn: Socket connection established to localhost/127.0.0.1:20000,
initiating session

14/02/04 01:20:31 INFO server.ZooKeeperServer: Client attempting to establish new session
at /127.0.0.1:46023

14/02/04 01:20:31 INFO persistence.FileTxnLog: Creating new log file: log.28d

14/02/04 01:20:31 INFO server.ZooKeeperServer: Established session 0x143fa7b4ee80000 with
negotiated timeout 1200000 for client /127.0.0.1:46023

14/02/04 01:20:31 INFO zookeeper.ClientCnxn: Session establishment complete on server localhost/127.0.0.1:20000,
sessionid = 0x143fa7b4ee80000, negotiated timeout = 1200000

14/02/04 01:20:32 INFO mortbay.log: Logging to org.slf4j.impl.Log4jLoggerAdapter(org.mortbay.log)
via org.mortbay.log.Slf4jLog

14/02/04 01:20:32 INFO mortbay.log: Created master and client sync clients

14/02/04 01:20:32 INFO mortbay.log: BSP root exists

14/02/04 01:20:32 INFO zookeeper.ZooKeeper: Initiating client connection, connectString=localhost:20000
sessionTimeout=1200000 watcher=org.apache.hama.bsp.sync.ZooKeeperSyncClientImpl@72f9c0

14/02/04 01:20:32 INFO sync.ZKSyncClient: Initializing ZK Sync Client

14/02/04 01:20:32 INFO zookeeper.ClientCnxn: Opening socket connection to server localhost/0:0:0:0:0:0:0:1:20000.
Will not attempt to authenticate using SASL (unknown error)

14/02/04 01:20:32 INFO sync.ZooKeeperSyncClientImpl: Start connecting to Zookeeper! At /0.0.0.0:21815

14/02/04 01:20:32 INFO server.NIOServerCnxnFactory: Accepted socket connection from /0:0:0:0:0:0:0:1:56862

14/02/04 01:20:32 INFO zookeeper.ClientCnxn: Socket connection established to localhost/0:0:0:0:0:0:0:1:20000,
initiating session

14/02/04 01:20:32 INFO server.ZooKeeperServer: Client attempting to establish new session
at /0:0:0:0:0:0:0:1:56862

14/02/04 01:20:32 INFO server.ZooKeeperServer: Established session 0x143fa7b4ee80001 with
negotiated timeout 1200000 for client /0:0:0:0:0:0:0:1:56862

14/02/04 01:20:32 INFO zookeeper.ClientCnxn: Session establishment complete on server localhost/0:0:0:0:0:0:0:1:20000,
sessionid = 0x143fa7b4ee80001, negotiated timeout = 1200000

14/02/04 01:20:32 INFO sync.ZKSyncClient: Writing data /bsp/job_test1_0001/info/level2

14/02/04 01:20:32 INFO mortbay.log: Found child count = 2

14/02/04 01:20:32 INFO mortbay.log: Passed the child count test

14/02/04 01:20:32 INFO mortbay.log: Found child count = 2

14/02/04 01:20:32 INFO mortbay.log:  Peer name 2

14/02/04 01:20:32 INFO mortbay.log:  Peer name 1

14/02/04 01:20:32 INFO mortbay.log: Passed the child key set test

14/02/04 01:20:33 INFO mortbay.log: /bsp/job_test1_0001

14/02/04 01:20:33 INFO mortbay.log: Passed the key presence test

14/02/04 01:20:33 INFO sync.ZKSyncClient: Writing data /bsp/job_test1_0001/info/level3

14/02/04 01:20:33 INFO mortbay.log: Passed array writable test

14/02/04 01:20:33 INFO server.NIOServerCnxn: Closed socket connection for client /127.0.0.1:46023
which had sessionid 0x143fa7b4ee80000

14/02/04 01:20:33 INFO zookeeper.ClientCnxn: Unable to read additional data from server sessionid
0x143fa7b4ee80000, likely server has closed socket, closing socket connection and attempting
reconnect

14/02/04 01:20:33 INFO server.NIOServerCnxn: Closed socket connection for client /0:0:0:0:0:0:0:1:56862
which had sessionid 0x143fa7b4ee80001

14/02/04 01:20:33 INFO server.NIOServerCnxnFactory: NIOServerCnxn factory exited run method

14/02/04 01:20:33 INFO zookeeper.ClientCnxn: Unable to read additional data from server sessionid
0x143fa7b4ee80001, likely server has closed socket, closing socket connection and attempting
reconnect

14/02/04 01:20:33 INFO server.ZooKeeperServer: shutting down

14/02/04 01:20:33 INFO server.SessionTrackerImpl: Shutting down

14/02/04 01:20:33 INFO server.PrepRequestProcessor: Shutting down

14/02/04 01:20:33 INFO server.SyncRequestProcessor: Shutting down

14/02/04 01:20:33 INFO server.PrepRequestProcessor: PrepRequestProcessor exited loop!

14/02/04 01:20:33 INFO server.SyncRequestProcessor: SyncRequestProcessor exited!

14/02/04 01:20:33 INFO server.FinalRequestProcessor: shutdown of request processor complete

Tests run: 1, Failures: 0, Errors: 0, Skipped: 0, Time elapsed: 0.02 sec

Results :

Tests in error: 

Tests run: 70, Failures: 0, Errors: 1, Skipped: 0

[INFO] ------------------------------------------------------------------------
[INFO] Reactor Summary:
[INFO] 
[INFO] Apache Hama parent POM ............................ SUCCESS [7.258s]
[INFO] pipes ............................................. SUCCESS [29.700s]
[INFO] commons ........................................... SUCCESS [21.990s]
[INFO] core .............................................. FAILURE [4:00.843s]
[INFO] graph ............................................. SKIPPED
[INFO] machine learning .................................. SKIPPED
[INFO] examples .......................................... SKIPPED
[INFO] hama-dist ......................................... SKIPPED
[INFO] ------------------------------------------------------------------------
[INFO] BUILD FAILURE
[INFO] ------------------------------------------------------------------------
[INFO] Total time: 5:01.115s
[INFO] Finished at: Tue Feb 04 01:20:33 UTC 2014
[INFO] Final Memory: 54M/440M
[INFO] ------------------------------------------------------------------------
[ERROR] Failed to execute goal org.apache.maven.plugins:maven-surefire-plugin:2.6:test (default-test)
on project hama-core: There are test failures.
[ERROR] 
[ERROR] Please refer to <https://builds.apache.org/job/Hama-Nightly-for-Hadoop-1.x/ws/trunk/core/target/surefire-reports>
for the individual test results.
[ERROR] -> [Help 1]
[ERROR] 
[ERROR] To see the full stack trace of the errors, re-run Maven with the -e switch.
[ERROR] Re-run Maven using the -X switch to enable full debug logging.
[ERROR] 
[ERROR] For more information about the errors and possible solutions, please read the following
articles:
[ERROR] [Help 1] http://cwiki.apache.org/confluence/display/MAVEN/MojoFailureException
[ERROR] 
[ERROR] After correcting the problems, you can resume the build with the command
[ERROR]   mvn <goals> -rf :hama-core
Build step 'Invoke top-level Maven targets' marked build as failure
Archiving artifacts
Recording test results
Updating HAMA-859
Updating HAMA-862

Mime
View raw message