hama-dev mailing list archives

Site index · List index
Message view « Date » · « Thread »
Top « Date » · « Thread »
From Apache Jenkins Server <jenk...@builds.apache.org>
Subject Build failed in Jenkins: Hama-trunk #277
Date Thu, 20 Feb 2014 02:15:03 GMT
See <https://builds.apache.org/job/Hama-trunk/277/changes>

Changes:

[edwardyoon] HAMA-873: Display counters of job on master's web page (Saisai Shao via edwardyoon)

[edwardyoon] HAMA-870: Runtime message compression in Bundle (edwardyoon)

------------------------------------------
[...truncated 1339 lines...]
Downloaded: http://repo.maven.apache.org/maven2/org/apache/maven/doxia/doxia-site-renderer/1.2/doxia-site-renderer-1.2.jar
(51 KB at 4624.6 KB/sec)
Downloading: http://repo.maven.apache.org/maven2/org/apache/maven/doxia/doxia-module-xhtml/1.2/doxia-module-xhtml-1.2.jar
4/15 KB    
8/15 KB   
12/15 KB   
15/15 KB   
           
Downloaded: http://repo.maven.apache.org/maven2/org/apache/maven/doxia/doxia-module-xhtml/1.2/doxia-module-xhtml-1.2.jar
(15 KB at 2106.0 KB/sec)
Downloading: http://repo.maven.apache.org/maven2/org/apache/maven/doxia/doxia-module-fml/1.2/doxia-module-fml-1.2.jar
4/37 KB    
8/37 KB   
12/37 KB   
16/37 KB   
17/37 KB   
18/37 KB   
21/37 KB   
23/37 KB   
24/37 KB   
27/37 KB   
31/37 KB   
34/37 KB   
37/37 KB   
           
Downloaded: http://repo.maven.apache.org/maven2/org/apache/maven/doxia/doxia-module-fml/1.2/doxia-module-fml-1.2.jar
(37 KB at 4107.9 KB/sec)
Downloading: http://repo.maven.apache.org/maven2/org/codehaus/plexus/plexus-i18n/1.0-beta-7/plexus-i18n-1.0-beta-7.jar
4/11 KB    
8/11 KB   
11/11 KB   
           
Downloaded: http://repo.maven.apache.org/maven2/org/codehaus/plexus/plexus-i18n/1.0-beta-7/plexus-i18n-1.0-beta-7.jar
(11 KB at 1466.1 KB/sec)
Downloading: http://repo.maven.apache.org/maven2/org/codehaus/plexus/plexus-velocity/1.1.7/plexus-velocity-1.1.7.jar
4/8 KB     
8/8 KB   
         
Downloaded: http://repo.maven.apache.org/maven2/org/codehaus/plexus/plexus-velocity/1.1.7/plexus-velocity-1.1.7.jar
(8 KB at 936.0 KB/sec)
Downloading: http://repo.maven.apache.org/maven2/org/apache/velocity/velocity/1.5/velocity-1.5.jar
4/383 KB   
8/383 KB   
12/383 KB   
16/383 KB   
17/383 KB   
18/383 KB   
21/383 KB   
25/383 KB   
29/383 KB   
33/383 KB   
34/383 KB   
37/383 KB   
38/383 KB   
42/383 KB   
46/383 KB   
50/383 KB   
54/383 KB   
58/383 KB   
59/383 KB   
63/383 KB   
67/383 KB   
71/383 KB   
75/383 KB   
75/383 KB   
79/383 KB   
83/383 KB   
87/383 KB   
88/383 KB   
92/383 KB   
96/383 KB   
100/383 KB   
104/383 KB   
108/383 KB   
109/383 KB   
113/383 KB   
117/383 KB   
121/383 KB   
125/383 KB   
129/383 KB   
130/383 KB   
134/383 KB   
138/383 KB   
142/383 KB   
146/383 KB   
150/383 KB   
154/383 KB   
158/383 KB   
162/383 KB   
166/383 KB   
170/383 KB   
171/383 KB   
175/383 KB   
179/383 KB   
183/383 KB   
187/383 KB   
191/383 KB   
194/383 KB   
198/383 KB   
202/383 KB   
206/383 KB   
210/383 KB   
214/383 KB   
218/383 KB   
222/383 KB   
226/383 KB   
230/383 KB   
234/383 KB   
238/383 KB   
242/383 KB   
246/383 KB   
250/383 KB   
254/383 KB   
258/383 KB   
262/383 KB   
266/383 KB   
270/383 KB   
274/383 KB   
278/383 KB   
282/383 KB   
286/383 KB   
290/383 KB   
294/383 KB   
298/383 KB   
302/383 KB   
306/383 KB   
310/383 KB   
314/383 KB   
318/383 KB   
322/383 KB   
326/383 KB   
330/383 KB   
334/383 KB   
338/383 KB   
342/383 KB   
346/383 KB   
350/383 KB   
354/383 KB   
358/383 KB   
362/383 KB   
366/383 KB   
370/383 KB   
374/383 KB   
378/383 KB   
382/383 KB   
383/383 KB   
             
Downloaded: http://repo.maven.apache.org/maven2/org/apache/velocity/velocity/1.5/velocity-1.5.jar
(383 KB at 4909.4 KB/sec)
Downloading: http://repo.maven.apache.org/maven2/oro/oro/2.0.8/oro-2.0.8.jar
             
Downloading: http://repo.maven.apache.org/maven2/org/apache/maven/reporting/maven-reporting-api/3.0/maven-reporting-api-3.0.jar
1/11 KB      
5/11 KB   
9/11 KB   
11/11 KB   
           
Downloaded: http://repo.maven.apache.org/maven2/org/apache/maven/reporting/maven-reporting-api/3.0/maven-reporting-api-3.0.jar
(11 KB at 890.3 KB/sec)
Downloading: http://repo.maven.apache.org/maven2/org/codehaus/plexus/plexus-utils/3.0.8/plexus-utils-3.0.8.jar
4/227 KB   
8/227 KB   
12/227 KB   
16/227 KB   
20/227 KB   
24/227 KB   
28/227 KB   
32/227 KB   
36/227 KB   
40/227 KB   
44/227 KB   
48/227 KB   
52/227 KB   
56/227 KB   
60/227 KB   
64/227 KB   
68/227 KB   
72/227 KB   
76/227 KB   
80/227 KB   
84/227 KB   
88/227 KB   
92/227 KB   
96/227 KB   
100/227 KB   
104/227 KB   
108/227 KB   
112/227 KB   
116/227 KB   
120/227 KB   
124/227 KB   
128/227 KB   
132/227 KB   
136/227 KB   
140/227 KB   
144/227 KB   
148/227 KB   
152/227 KB   
156/227 KB   
160/227 KB   
164/227 KB   
168/227 KB   
172/227 KB   
176/227 KB   
180/227 KB   
184/227 KB   
188/227 KB   
192/227 KB   
196/227 KB   
200/227 KB   
204/227 KB   
208/227 KB   
212/227 KB   
216/227 KB   
220/227 KB   
224/227 KB   
227/227 KB   
             
Downloaded: http://repo.maven.apache.org/maven2/org/codehaus/plexus/plexus-utils/3.0.8/plexus-utils-3.0.8.jar
(227 KB at 5145.2 KB/sec)
             
             
Downloaded: http://repo.maven.apache.org/maven2/commons-collections/commons-collections/3.2.1/commons-collections-3.2.1.jar
(0 B at 0.0 KB/sec)
             
Downloaded: http://repo.maven.apache.org/maven2/commons-cli/commons-cli/1.2/commons-cli-1.2.jar
(0 B at 0.0 KB/sec)
             
Downloaded: http://repo.maven.apache.org/maven2/commons-lang/commons-lang/2.6/commons-lang-2.6.jar
(0 B at 0.0 KB/sec)
[INFO] ------------------------------------------------------------------------
[INFO] Reactor Summary:
[INFO] 
[INFO] Apache Hama parent POM ............................ FAILURE [21.840s]
[INFO] pipes ............................................. SKIPPED
[INFO] commons ........................................... SKIPPED
[INFO] core .............................................. SKIPPED
[INFO] graph ............................................. SKIPPED
[INFO] machine learning .................................. SKIPPED
[INFO] examples .......................................... SKIPPED
[INFO] hama-dist ......................................... SKIPPED
[INFO] ------------------------------------------------------------------------
[INFO] BUILD FAILURE
[INFO] ------------------------------------------------------------------------
[INFO] Total time: 23.188s
[INFO] Finished at: Thu Feb 20 02:14:53 UTC 2014
[INFO] Final Memory: 15M/179M
[INFO] ------------------------------------------------------------------------
[ERROR] Failed to execute goal org.apache.rat:apache-rat-plugin:0.10:check (default) on project
hama-parent: Execution default of goal org.apache.rat:apache-rat-plugin:0.10:check failed:
Plugin org.apache.rat:apache-rat-plugin:0.10 or one of its dependencies could not be resolved:
The following artifacts could not be resolved: commons-logging:commons-logging:jar:1.1.1,
oro:oro:jar:2.0.8: Could not transfer artifact commons-logging:commons-logging:jar:1.1.1 from/to
central (http://repo.maven.apache.org/maven2): Failed to transfer file: http://repo.maven.apache.org/maven2/commons-logging/commons-logging/1.1.1/commons-logging-1.1.1.jar.
Return code is: 503, ReasonPhrase:Connection timed out. -> [Help 1]
[ERROR] 
[ERROR] To see the full stack trace of the errors, re-run Maven with the -e switch.
[ERROR] Re-run Maven using the -X switch to enable full debug logging.
[ERROR] 
[ERROR] For more information about the errors and possible solutions, please read the following
articles:
[ERROR] [Help 1] http://cwiki.apache.org/confluence/display/MAVEN/PluginResolutionException
Build step 'Invoke top-level Maven targets' marked build as failure
Archiving artifacts
Recording test results
Updating HAMA-870
Updating HAMA-873

Mime
View raw message