hama-dev mailing list archives

Site index · List index
Message view « Date » · « Thread »
Top « Date » · « Thread »
From Apache Jenkins Server <jenk...@builds.apache.org>
Subject Build failed in Jenkins: Hama-trunk #271
Date Mon, 17 Feb 2014 09:14:46 GMT
See <https://builds.apache.org/job/Hama-trunk/271/changes>

Changes:

[millecker] HAMA-871: NPE when building core module due to gmaven-plugin

------------------------------------------
[...truncated 8984 lines...]
                                 
Downloaded: http://repo.maven.apache.org/maven2/org/apache/maven/doxia/doxia-sink-api/1.0-alpha-8/doxia-sink-api-1.0-alpha-8.jar
(7 KB at 233.8 KB/sec)
Downloading: http://repo.maven.apache.org/maven2/commons-validator/commons-validator/1.2.0/commons-validator-1.2.0.jar
200/200 KB   4/12 KB             
200/200 KB   4/40 KB   4/12 KB   
200/200 KB   8/40 KB   4/12 KB   
200/200 KB   12/40 KB   4/12 KB   
200/200 KB   16/40 KB   4/12 KB   
200/200 KB   20/40 KB   4/12 KB   
200/200 KB   24/40 KB   4/12 KB   
200/200 KB   28/40 KB   4/12 KB   
200/200 KB   32/40 KB   4/12 KB   
200/200 KB   36/40 KB   4/12 KB   
200/200 KB   40/40 KB   4/12 KB   
200/200 KB   40/40 KB   7/12 KB   
200/200 KB   40/40 KB   11/12 KB   
200/200 KB   40/40 KB   12/12 KB   
200/200 KB   40/40 KB   4/14 KB   12/12 KB   
200/200 KB   40/40 KB   8/14 KB   12/12 KB   
200/200 KB   40/40 KB   12/14 KB   12/12 KB   
200/200 KB   40/40 KB   14/14 KB   12/12 KB   
200/200 KB   40/40 KB   14/14 KB   12/12 KB   2/89 KB   
200/200 KB   40/40 KB   14/14 KB   12/12 KB   6/89 KB   
200/200 KB   40/40 KB   14/14 KB   12/12 KB   10/89 KB   
200/200 KB   40/40 KB   14/14 KB   12/12 KB   14/89 KB   
200/200 KB   40/40 KB   14/14 KB   12/12 KB   18/89 KB   
200/200 KB   40/40 KB   14/14 KB   12/12 KB   22/89 KB   
200/200 KB   40/40 KB   14/14 KB   12/12 KB   26/89 KB   
200/200 KB   40/40 KB   14/14 KB   12/12 KB   30/89 KB   
200/200 KB   40/40 KB   14/14 KB   12/12 KB   34/89 KB   
200/200 KB   40/40 KB   14/14 KB   12/12 KB   38/89 KB   
200/200 KB   40/40 KB   14/14 KB   12/12 KB   42/89 KB   
200/200 KB   40/40 KB   14/14 KB   12/12 KB   46/89 KB   
200/200 KB   40/40 KB   14/14 KB   12/12 KB   50/89 KB   
200/200 KB   40/40 KB   14/14 KB   12/12 KB   54/89 KB   
200/200 KB   40/40 KB   14/14 KB   12/12 KB   58/89 KB   
200/200 KB   40/40 KB   14/14 KB   12/12 KB   62/89 KB   
200/200 KB   40/40 KB   14/14 KB   12/12 KB   66/89 KB   
200/200 KB   40/40 KB   14/14 KB   12/12 KB   70/89 KB   
200/200 KB   40/40 KB   14/14 KB   12/12 KB   74/89 KB   
200/200 KB   40/40 KB   14/14 KB   12/12 KB   78/89 KB   
200/200 KB   40/40 KB   14/14 KB   12/12 KB   82/89 KB   
200/200 KB   40/40 KB   14/14 KB   12/12 KB   86/89 KB   
200/200 KB   40/40 KB   14/14 KB   12/12 KB   89/89 KB   
                                                         
Downloaded: http://repo.maven.apache.org/maven2/org/apache/maven/doxia/doxia-core/1.0-alpha-8/doxia-core-1.0-alpha-8.jar
(200 KB at 4154.6 KB/sec)
Downloading: http://repo.maven.apache.org/maven2/commons-beanutils/commons-beanutils/1.7.0/commons-beanutils-1.7.0.jar
                                                         
Downloaded: http://repo.maven.apache.org/maven2/org/codehaus/plexus/plexus-i18n/1.0-beta-6/plexus-i18n-1.0-beta-6.jar
(12 KB at 390.9 KB/sec)
Downloading: http://repo.maven.apache.org/maven2/commons-digester/commons-digester/1.6/commons-digester-1.6.jar
                                                         
Downloaded: http://repo.maven.apache.org/maven2/org/apache/maven/doxia/doxia-decoration-model/1.0-alpha-8/doxia-decoration-model-1.0-alpha-8.jar
(40 KB at 1270.5 KB/sec)
Downloading: http://repo.maven.apache.org/maven2/commons-logging/commons-logging/1.0.4/commons-logging-1.0.4.jar
                                                         
Downloaded: http://repo.maven.apache.org/maven2/commons-validator/commons-validator/1.2.0/commons-validator-1.2.0.jar
(89 KB at 2965.9 KB/sec)
Downloading: http://repo.maven.apache.org/maven2/xml-apis/xml-apis/1.0.b2/xml-apis-1.0.b2.jar
                                                         
Downloaded: http://repo.maven.apache.org/maven2/org/apache/maven/reporting/maven-reporting-impl/2.0.4/maven-reporting-impl-2.0.4.jar
(14 KB at 416.7 KB/sec)
Downloading: http://repo.maven.apache.org/maven2/oro/oro/2.0.7/oro-2.0.7.jar
3/185 KB                                                 
7/185 KB   
11/185 KB   
15/185 KB   
19/185 KB   
23/185 KB   
27/185 KB   
31/185 KB   
35/185 KB   
39/185 KB   
43/185 KB   
47/185 KB   
51/185 KB   
55/185 KB   
59/185 KB   
63/185 KB   
67/185 KB   
71/185 KB   
75/185 KB   
79/185 KB   
83/185 KB   
87/185 KB   
91/185 KB   
95/185 KB   
99/185 KB   
103/185 KB   
107/185 KB   
111/185 KB   
115/185 KB   
119/185 KB   
123/185 KB   
127/185 KB   
131/185 KB   
135/185 KB   
139/185 KB   
143/185 KB   
147/185 KB   
151/185 KB   
155/185 KB   
159/185 KB   
163/185 KB   
167/185 KB   
170/185 KB   
170/185 KB   1/165 KB   
170/185 KB   5/165 KB   
170/185 KB   9/165 KB   
170/185 KB   13/165 KB   
170/185 KB   17/165 KB   
170/185 KB   21/165 KB   
170/185 KB   25/165 KB   
170/185 KB   29/165 KB   
170/185 KB   33/165 KB   
170/185 KB   37/165 KB   
170/185 KB   41/165 KB   
170/185 KB   45/165 KB   
170/185 KB   49/165 KB   
170/185 KB   53/165 KB   
170/185 KB   57/165 KB   
170/185 KB   61/165 KB   
170/185 KB   65/165 KB   
170/185 KB   69/165 KB   
170/185 KB   73/165 KB   
170/185 KB   77/165 KB   
170/185 KB   81/165 KB   
170/185 KB   85/165 KB   
170/185 KB   89/165 KB   
170/185 KB   93/165 KB   
170/185 KB   97/165 KB   
170/185 KB   101/165 KB   
170/185 KB   105/165 KB   
170/185 KB   109/165 KB   
170/185 KB   113/165 KB   
170/185 KB   117/165 KB   
170/185 KB   121/165 KB   
170/185 KB   125/165 KB   
170/185 KB   129/165 KB   
170/185 KB   133/165 KB   
170/185 KB   137/165 KB   
170/185 KB   141/165 KB   
170/185 KB   145/165 KB   
170/185 KB   149/165 KB   
170/185 KB   153/165 KB   
170/185 KB   157/165 KB   
170/185 KB   161/165 KB   
170/185 KB   165/165 KB   
170/185 KB   165/165 KB   4/38 KB   
170/185 KB   165/165 KB   8/38 KB   
170/185 KB   165/165 KB   12/38 KB   
170/185 KB   165/165 KB   16/38 KB   
170/185 KB   165/165 KB   20/38 KB   
170/185 KB   165/165 KB   24/38 KB   
170/185 KB   165/165 KB   28/38 KB   
170/185 KB   165/165 KB   32/38 KB   
170/185 KB   165/165 KB   36/38 KB   
170/185 KB   165/165 KB   38/38 KB   
4/107 KB   170/185 KB   165/165 KB   38/38 KB   
7/107 KB   170/185 KB   165/165 KB   38/38 KB   
11/107 KB   170/185 KB   165/165 KB   38/38 KB   
15/107 KB   170/185 KB   165/165 KB   38/38 KB   
19/107 KB   170/185 KB   165/165 KB   38/38 KB   
23/107 KB   170/185 KB   165/165 KB   38/38 KB   
27/107 KB   170/185 KB   165/165 KB   38/38 KB   
31/107 KB   170/185 KB   165/165 KB   38/38 KB   
35/107 KB   170/185 KB   165/165 KB   38/38 KB   
39/107 KB   170/185 KB   165/165 KB   38/38 KB   
43/107 KB   170/185 KB   165/165 KB   38/38 KB   
47/107 KB   170/185 KB   165/165 KB   38/38 KB   
51/107 KB   170/185 KB   165/165 KB   38/38 KB   
55/107 KB   170/185 KB   165/165 KB   38/38 KB   
59/107 KB   170/185 KB   165/165 KB   38/38 KB   
63/107 KB   170/185 KB   165/165 KB   38/38 KB   
67/107 KB   170/185 KB   165/165 KB   38/38 KB   
71/107 KB   170/185 KB   165/165 KB   38/38 KB   
75/107 KB   170/185 KB   165/165 KB   38/38 KB   
79/107 KB   170/185 KB   165/165 KB   38/38 KB   
83/107 KB   170/185 KB   165/165 KB   38/38 KB   
87/107 KB   170/185 KB   165/165 KB   38/38 KB   
91/107 KB   170/185 KB   165/165 KB   38/38 KB   
95/107 KB   170/185 KB   165/165 KB   38/38 KB   
99/107 KB   170/185 KB   165/165 KB   38/38 KB   
99/107 KB   171/185 KB   165/165 KB   38/38 KB   
103/107 KB   171/185 KB   165/165 KB   38/38 KB   
103/107 KB   173/185 KB   165/165 KB   38/38 KB   
107/107 KB   173/185 KB   165/165 KB   38/38 KB   
107/107 KB   173/185 KB   165/165 KB   38/38 KB   
3/64 KB   107/107 KB   173/185 KB   165/165 KB   38/38 KB   
7/64 KB   107/107 KB   173/185 KB   165/165 KB   38/38 KB   
11/64 KB   107/107 KB   173/185 KB   165/165 KB   38/38 KB   
15/64 KB   107/107 KB   173/185 KB   165/165 KB   38/38 KB   
19/64 KB   107/107 KB   173/185 KB   165/165 KB   38/38 KB   
23/64 KB   107/107 KB   173/185 KB   165/165 KB   38/38 KB   
27/64 KB   107/107 KB   173/185 KB   165/165 KB   38/38 KB   
31/64 KB   107/107 KB   173/185 KB   165/165 KB   38/38 KB   
35/64 KB   107/107 KB   173/185 KB   165/165 KB   38/38 KB   
39/64 KB   107/107 KB   173/185 KB   165/165 KB   38/38 KB   
43/64 KB   107/107 KB   173/185 KB   165/165 KB   38/38 KB   
47/64 KB   107/107 KB   173/185 KB   165/165 KB   38/38 KB   
51/64 KB   107/107 KB   173/185 KB   165/165 KB   38/38 KB   
55/64 KB   107/107 KB   173/185 KB   165/165 KB   38/38 KB   
59/64 KB   107/107 KB   173/185 KB   165/165 KB   38/38 KB   
63/64 KB   107/107 KB   173/185 KB   165/165 KB   38/38 KB   
64/64 KB   107/107 KB   173/185 KB   165/165 KB   38/38 KB   
64/64 KB   107/107 KB   177/185 KB   165/165 KB   38/38 KB   
64/64 KB   107/107 KB   181/185 KB   165/165 KB   38/38 KB   
64/64 KB   107/107 KB   185/185 KB   165/165 KB   38/38 KB   
64/64 KB   107/107 KB   185/185 KB   165/165 KB   38/38 KB   
                                                             
Downloaded: http://repo.maven.apache.org/maven2/commons-digester/commons-digester/1.6/commons-digester-1.6.jar
(165 KB at 5483.3 KB/sec)
Downloading: http://repo.maven.apache.org/maven2/org/apache/maven/reporting/maven-reporting-api/2.0.4/maven-reporting-api-2.0.4.jar
                                                             
Downloaded: http://repo.maven.apache.org/maven2/commons-logging/commons-logging/1.0.4/commons-logging-1.0.4.jar
(38 KB at 1280.1 KB/sec)
                                                             
Downloaded: http://repo.maven.apache.org/maven2/xml-apis/xml-apis/1.0.b2/xml-apis-1.0.b2.jar
(107 KB at 3558.5 KB/sec)
                                                             
Downloaded: http://repo.maven.apache.org/maven2/oro/oro/2.0.7/oro-2.0.7.jar (64 KB at 2203.2
KB/sec)
                                                             
Downloaded: http://repo.maven.apache.org/maven2/commons-beanutils/commons-beanutils/1.7.0/commons-beanutils-1.7.0.jar
(185 KB at 4386.9 KB/sec)
4/5 KB                                                       
5/5 KB   
         
Downloaded: http://repo.maven.apache.org/maven2/org/apache/maven/reporting/maven-reporting-api/2.0.4/maven-reporting-api-2.0.4.jar
(5 KB at 187.3 KB/sec)
[INFO] ------------------------------------------------------------------------
[INFO] Reactor Summary:
[INFO] 
[INFO] Apache Hama parent POM ............................ FAILURE [15.891s]
[INFO] pipes ............................................. SKIPPED
[INFO] commons ........................................... SKIPPED
[INFO] core .............................................. SKIPPED
[INFO] graph ............................................. SKIPPED
[INFO] machine learning .................................. SKIPPED
[INFO] examples .......................................... SKIPPED
[INFO] hama-dist ......................................... SKIPPED
[INFO] ------------------------------------------------------------------------
[INFO] BUILD FAILURE
[INFO] ------------------------------------------------------------------------
[INFO] Total time: 17.605s
[INFO] Finished at: Mon Feb 17 09:14:29 UTC 2014
[INFO] Final Memory: 13M/77M
[INFO] ------------------------------------------------------------------------
[ERROR] Failed to execute goal org.apache.rat:apache-rat-plugin:0.8:check (default) on project
hama-parent: Execution default of goal org.apache.rat:apache-rat-plugin:0.8:check failed:
Plugin org.apache.rat:apache-rat-plugin:0.8 or one of its dependencies could not be resolved:
Could not find artifact commons-cli:commons-cli:jar:1.2 -> [Help 1]
[ERROR] 
[ERROR] To see the full stack trace of the errors, re-run Maven with the -e switch.
[ERROR] Re-run Maven using the -X switch to enable full debug logging.
[ERROR] 
[ERROR] For more information about the errors and possible solutions, please read the following
articles:
[ERROR] [Help 1] http://cwiki.apache.org/confluence/display/MAVEN/PluginResolutionException
Build step 'Invoke top-level Maven targets' marked build as failure
Archiving artifacts
Recording test results
Updating HAMA-871

Mime
View raw message