hama-dev mailing list archives

Site index · List index
Message view « Date » · « Thread »
Top « Date » · « Thread »
From Apache Jenkins Server <jenk...@builds.apache.org>
Subject Build failed in Jenkins: Hama-Nightly-for-Hadoop-1.x #1186
Date Wed, 19 Feb 2014 00:05:16 GMT
See <https://builds.apache.org/job/Hama-Nightly-for-Hadoop-1.x/1186/changes>

Changes:

[edwardyoon] 

[edwardyoon] revert meaningless code changes.

[edwardyoon] HAMA-868: Fix SemiClustering bugs (edwardyoon)

------------------------------------------
[...truncated 12833 lines...]
173/287 KB   7/227 KB   226/383 KB   
173/287 KB   7/227 KB   228/383 KB   
173/287 KB   7/227 KB   232/383 KB   
173/287 KB   7/227 KB   236/383 KB   
173/287 KB   7/227 KB   240/383 KB   
173/287 KB   7/227 KB   244/383 KB   
173/287 KB   7/227 KB   246/383 KB   
173/287 KB   11/227 KB   246/383 KB   
173/287 KB   11/227 KB   250/383 KB   
173/287 KB   11/227 KB   254/383 KB   
173/287 KB   15/227 KB   254/383 KB   
173/287 KB   15/227 KB   258/383 KB   
173/287 KB   16/227 KB   258/383 KB   
173/287 KB   16/227 KB   262/383 KB   
173/287 KB   16/227 KB   266/383 KB   
173/287 KB   16/227 KB   270/383 KB   
173/287 KB   16/227 KB   272/383 KB   
177/287 KB   16/227 KB   272/383 KB   
177/287 KB   16/227 KB   276/383 KB   
178/287 KB   16/227 KB   276/383 KB   
178/287 KB   16/227 KB   280/383 KB   
178/287 KB   16/227 KB   284/383 KB   
178/287 KB   16/227 KB   287/383 KB   
178/287 KB   16/227 KB   291/383 KB   
178/287 KB   16/227 KB   295/383 KB   
178/287 KB   20/227 KB   295/383 KB   
178/287 KB   20/227 KB   299/383 KB   
178/287 KB   21/227 KB   299/383 KB   
178/287 KB   21/227 KB   303/383 KB   
178/287 KB   24/227 KB   303/383 KB   
178/287 KB   24/227 KB   307/383 KB   
178/287 KB   24/227 KB   311/383 KB   
178/287 KB   24/227 KB   315/383 KB   
178/287 KB   24/227 KB   319/383 KB   
178/287 KB   24/227 KB   323/383 KB   
178/287 KB   24/227 KB   327/383 KB   
178/287 KB   24/227 KB   331/383 KB   
182/287 KB   24/227 KB   331/383 KB   
182/287 KB   24/227 KB   332/383 KB   
184/287 KB   24/227 KB   332/383 KB   
184/287 KB   24/227 KB   336/383 KB   
184/287 KB   24/227 KB   339/383 KB   
184/287 KB   24/227 KB   343/383 KB   
184/287 KB   24/227 KB   347/383 KB   
184/287 KB   24/227 KB   349/383 KB   
184/287 KB   24/227 KB   353/383 KB   
184/287 KB   28/227 KB   353/383 KB   
184/287 KB   28/227 KB   357/383 KB   
184/287 KB   31/227 KB   357/383 KB   
184/287 KB   31/227 KB   361/383 KB   
184/287 KB   34/227 KB   361/383 KB   
184/287 KB   34/227 KB   365/383 KB   
184/287 KB   34/227 KB   369/383 KB   
184/287 KB   34/227 KB   373/383 KB   
184/287 KB   34/227 KB   377/383 KB   
184/287 KB   34/227 KB   381/383 KB   
184/287 KB   34/227 KB   383/383 KB   
188/287 KB   34/227 KB   383/383 KB   
190/287 KB   34/227 KB   383/383 KB   
190/287 KB   38/227 KB   383/383 KB   
190/287 KB   41/227 KB   383/383 KB   
190/287 KB   44/227 KB   383/383 KB   
194/287 KB   44/227 KB   383/383 KB   
195/287 KB   44/227 KB   383/383 KB   
195/287 KB   48/227 KB   383/383 KB   
195/287 KB   51/227 KB   383/383 KB   
195/287 KB   54/227 KB   383/383 KB   
199/287 KB   54/227 KB   383/383 KB   
199/287 KB   54/227 KB   383/383 KB   
199/287 KB   58/227 KB   383/383 KB   
199/287 KB   58/227 KB   383/383 KB   
199/287 KB   61/227 KB   383/383 KB   
199/287 KB   62/227 KB   383/383 KB   
199/287 KB   64/227 KB   383/383 KB   
                                      
203/287 KB   64/227 KB                
Downloaded: http://repo.maven.apache.org/maven2/org/apache/velocity/velocity/1.5/velocity-1.5.jar
(383 KB at 20154.4 KB/sec)
205/287 KB   64/227 KB   
205/287 KB   68/227 KB   
205/287 KB   68/227 KB   
205/287 KB   69/227 KB   
205/287 KB   71/227 KB   
205/287 KB   74/227 KB   
207/287 KB   74/227 KB   
209/287 KB   74/227 KB   
209/287 KB   76/227 KB   
209/287 KB   78/227 KB   
209/287 KB   81/227 KB   
209/287 KB   82/227 KB   
209/287 KB   84/227 KB   
213/287 KB   84/227 KB   
215/287 KB   84/227 KB   
215/287 KB   86/227 KB   
216/287 KB   86/227 KB   
4/170 KB   216/287 KB   86/227 KB   
8/170 KB   216/287 KB   86/227 KB   
12/170 KB   216/287 KB   86/227 KB   
14/170 KB   216/287 KB   86/227 KB   
18/170 KB   216/287 KB   86/227 KB   
22/170 KB   216/287 KB   86/227 KB   
26/170 KB   216/287 KB   86/227 KB   
30/170 KB   216/287 KB   86/227 KB   
34/170 KB   216/287 KB   86/227 KB   
37/170 KB   216/287 KB   86/227 KB   
41/170 KB   216/287 KB   86/227 KB   
45/170 KB   216/287 KB   86/227 KB   
48/170 KB   216/287 KB   86/227 KB   
52/170 KB   216/287 KB   86/227 KB   
56/170 KB   216/287 KB   86/227 KB   
59/170 KB   216/287 KB   86/227 KB   
61/170 KB   216/287 KB   86/227 KB   
65/170 KB   216/287 KB   86/227 KB   
69/170 KB   216/287 KB   86/227 KB   
71/170 KB   216/287 KB   86/227 KB   
75/170 KB   216/287 KB   86/227 KB   
79/170 KB   216/287 KB   86/227 KB   
82/170 KB   216/287 KB   86/227 KB   
86/170 KB   216/287 KB   86/227 KB   
90/170 KB   216/287 KB   86/227 KB   
92/170 KB   216/287 KB   86/227 KB   
95/170 KB   216/287 KB   86/227 KB   
98/170 KB   216/287 KB   86/227 KB   
102/170 KB   216/287 KB   86/227 KB   
102/170 KB   216/287 KB   86/227 KB   
103/170 KB   216/287 KB   86/227 KB   
106/170 KB   216/287 KB   86/227 KB   
109/170 KB   216/287 KB   86/227 KB   
112/170 KB   216/287 KB   86/227 KB   
113/170 KB   216/287 KB   86/227 KB   
117/170 KB   216/287 KB   86/227 KB   
117/170 KB   216/287 KB   86/227 KB   
121/170 KB   216/287 KB   86/227 KB   
123/170 KB   216/287 KB   86/227 KB   
126/170 KB   216/287 KB   86/227 KB   
129/170 KB   216/287 KB   86/227 KB   
130/170 KB   216/287 KB   86/227 KB   
133/170 KB   216/287 KB   86/227 KB   
134/170 KB   216/287 KB   86/227 KB   
136/170 KB   216/287 KB   86/227 KB   
137/170 KB   216/287 KB   86/227 KB   
140/170 KB   216/287 KB   86/227 KB   
143/170 KB   216/287 KB   86/227 KB   
147/170 KB   216/287 KB   86/227 KB   
151/170 KB   216/287 KB   86/227 KB   
151/170 KB   216/287 KB   86/227 KB   
154/170 KB   216/287 KB   86/227 KB   
158/170 KB   216/287 KB   86/227 KB   
161/170 KB   216/287 KB   86/227 KB   
163/170 KB   216/287 KB   86/227 KB   
166/170 KB   216/287 KB   86/227 KB   
170/170 KB   216/287 KB   86/227 KB   
170/170 KB   216/287 KB   86/227 KB   
                                      
Downloaded: http://repo.maven.apache.org/maven2/commons-io/commons-io/2.2/commons-io-2.2.jar
(170 KB at 733.8 KB/sec)
216/287 KB   90/227 KB                
216/287 KB   94/227 KB   
216/287 KB   98/227 KB   
216/287 KB   102/227 KB   
216/287 KB   106/227 KB   
216/287 KB   110/227 KB   
216/287 KB   114/227 KB   
216/287 KB   118/227 KB   
216/287 KB   122/227 KB   
216/287 KB   126/227 KB   
216/287 KB   130/227 KB   
216/287 KB   134/227 KB   
216/287 KB   138/227 KB   
216/287 KB   142/227 KB   
216/287 KB   146/227 KB   
216/287 KB   150/227 KB   
216/287 KB   154/227 KB   
216/287 KB   158/227 KB   
216/287 KB   162/227 KB   
216/287 KB   166/227 KB   
216/287 KB   170/227 KB   
216/287 KB   174/227 KB   
216/287 KB   178/227 KB   
216/287 KB   182/227 KB   
216/287 KB   183/227 KB   
216/287 KB   187/227 KB   
216/287 KB   191/227 KB   
216/287 KB   191/227 KB   
216/287 KB   192/227 KB   
216/287 KB   195/227 KB   
216/287 KB   199/227 KB   
216/287 KB   201/227 KB   
216/287 KB   202/227 KB   
216/287 KB   206/227 KB   
216/287 KB   208/227 KB   
216/287 KB   211/227 KB   
216/287 KB   212/227 KB   
216/287 KB   214/227 KB   
216/287 KB   216/227 KB   
216/287 KB   218/227 KB   
216/287 KB   221/227 KB   
216/287 KB   222/227 KB   
216/287 KB   224/227 KB   
216/287 KB   227/227 KB   
                          
Downloaded: http://repo.maven.apache.org/maven2/org/codehaus/plexus/plexus-utils/3.0.8/plexus-utils-3.0.8.jar
(227 KB at 1264.7 KB/sec)
220/287 KB                
224/287 KB   
228/287 KB   
232/287 KB   
236/287 KB   
240/287 KB   
244/287 KB   
248/287 KB   
252/287 KB   
256/287 KB   
260/287 KB   
264/287 KB   
268/287 KB   
272/287 KB   
276/287 KB   
280/287 KB   
284/287 KB   
287/287 KB   
             
Downloaded: http://repo.maven.apache.org/maven2/org/apache/httpcomponents/httpclient/4.0.2/httpclient-4.0.2.jar
(287 KB at 494.0 KB/sec)
[INFO] ------------------------------------------------------------------------
[INFO] Reactor Summary:
[INFO] 
[INFO] Apache Hama parent POM ............................ FAILURE [22.643s]
[INFO] pipes ............................................. SKIPPED
[INFO] commons ........................................... SKIPPED
[INFO] core .............................................. SKIPPED
[INFO] graph ............................................. SKIPPED
[INFO] machine learning .................................. SKIPPED
[INFO] examples .......................................... SKIPPED
[INFO] hama-dist ......................................... SKIPPED
[INFO] ------------------------------------------------------------------------
[INFO] BUILD FAILURE
[INFO] ------------------------------------------------------------------------
[INFO] Total time: 24.591s
[INFO] Finished at: Wed Feb 19 00:04:44 UTC 2014
[INFO] Final Memory: 16M/90M
[INFO] ------------------------------------------------------------------------
[ERROR] Failed to execute goal org.apache.rat:apache-rat-plugin:0.10:check (default) on project
hama-parent: Execution default of goal org.apache.rat:apache-rat-plugin:0.10:check failed:
Plugin org.apache.rat:apache-rat-plugin:0.10 or one of its dependencies could not be resolved:
The following artifacts could not be resolved: commons-collections:commons-collections:jar:3.2.1,
commons-lang:commons-lang:jar:2.6, commons-cli:commons-cli:jar:1.2, commons-logging:commons-logging:jar:1.1.1,
oro:oro:jar:2.0.8: Could not find artifact commons-collections:commons-collections:jar:3.2.1
-> [Help 1]
[ERROR] 
[ERROR] To see the full stack trace of the errors, re-run Maven with the -e switch.
[ERROR] Re-run Maven using the -X switch to enable full debug logging.
[ERROR] 
[ERROR] For more information about the errors and possible solutions, please read the following
articles:
[ERROR] [Help 1] http://cwiki.apache.org/confluence/display/MAVEN/PluginResolutionException
Build step 'Invoke top-level Maven targets' marked build as failure
Archiving artifacts
Recording test results
Updating HAMA-868

Mime
View raw message