hama-dev mailing list archives

Site index · List index
Message view « Date » · « Thread »
Top « Date » · « Thread »
From Apache Jenkins Server <jenk...@builds.apache.org>
Subject Build failed in Jenkins: Hama-Nightly-for-Hadoop-2.x #188
Date Tue, 25 Feb 2014 00:46:07 GMT
See <https://builds.apache.org/job/Hama-Nightly-for-Hadoop-2.x/188/>

------------------------------------------
[...truncated 12785 lines...]
1201/1201 KB   6/15 KB   40/51 KB   
1201/1201 KB   6/15 KB   44/51 KB   
1201/1201 KB   10/15 KB   44/51 KB   
1201/1201 KB   10/15 KB   48/51 KB   
1201/1201 KB   14/15 KB   48/51 KB   
1201/1201 KB   14/15 KB   51/51 KB   
1201/1201 KB   15/15 KB   51/51 KB   
                                     
Downloaded: http://repo.maven.apache.org/maven2/xerces/xercesImpl/2.9.1/xercesImpl-2.9.1.jar
(1201 KB at 15588.5 KB/sec)
Downloading: http://repo.maven.apache.org/maven2/org/codehaus/plexus/plexus-velocity/1.1.7/plexus-velocity-1.1.7.jar
4/37 KB   15/15 KB   51/51 KB        
8/37 KB   15/15 KB   51/51 KB   
12/37 KB   15/15 KB   51/51 KB   
16/37 KB   15/15 KB   51/51 KB   
20/37 KB   15/15 KB   51/51 KB   
24/37 KB   15/15 KB   51/51 KB   
28/37 KB   15/15 KB   51/51 KB   
32/37 KB   15/15 KB   51/51 KB   
36/37 KB   15/15 KB   51/51 KB   
37/37 KB   15/15 KB   51/51 KB   
4/11 KB   37/37 KB   15/15 KB   51/51 KB   
8/11 KB   37/37 KB   15/15 KB   51/51 KB   
11/11 KB   37/37 KB   15/15 KB   51/51 KB   
                                            
Downloaded: http://repo.maven.apache.org/maven2/org/apache/maven/doxia/doxia-module-xhtml/1.2/doxia-module-xhtml-1.2.jar
(15 KB at 546.0 KB/sec)
Downloading: http://repo.maven.apache.org/maven2/org/apache/velocity/velocity/1.5/velocity-1.5.jar
                                            
Downloaded: http://repo.maven.apache.org/maven2/org/apache/maven/doxia/doxia-site-renderer/1.2/doxia-site-renderer-1.2.jar
(51 KB at 1754.2 KB/sec)
Downloading: http://repo.maven.apache.org/maven2/oro/oro/2.0.8/oro-2.0.8.jar
4/8 KB   11/11 KB   37/37 KB                
8/8 KB   11/11 KB   37/37 KB   
                               
Downloaded: http://repo.maven.apache.org/maven2/org/apache/maven/doxia/doxia-module-fml/1.2/doxia-module-fml-1.2.jar
(37 KB at 1369.3 KB/sec)
Downloading: http://repo.maven.apache.org/maven2/org/apache/maven/reporting/maven-reporting-api/3.0/maven-reporting-api-3.0.jar
                               
Downloaded: http://repo.maven.apache.org/maven2/org/codehaus/plexus/plexus-i18n/1.0-beta-7/plexus-i18n-1.0-beta-7.jar
(11 KB at 380.1 KB/sec)
Downloading: http://repo.maven.apache.org/maven2/org/codehaus/plexus/plexus-utils/3.0.8/plexus-utils-3.0.8.jar
8/8 KB   1/64 KB               
8/8 KB   5/64 KB   
8/8 KB   9/64 KB   
8/8 KB   13/64 KB   
8/8 KB   17/64 KB   
8/8 KB   21/64 KB   
8/8 KB   25/64 KB   
8/8 KB   29/64 KB   
8/8 KB   33/64 KB   
4/383 KB   8/8 KB   33/64 KB   
4/383 KB   8/8 KB   37/64 KB   
4/383 KB   8/8 KB   41/64 KB   
8/383 KB   8/8 KB   41/64 KB   
8/383 KB   8/8 KB   45/64 KB   
12/383 KB   8/8 KB   45/64 KB   
12/383 KB   8/8 KB   49/64 KB   
16/383 KB   8/8 KB   49/64 KB   
16/383 KB   8/8 KB   53/64 KB   
16/383 KB   8/8 KB   57/64 KB   
20/383 KB   8/8 KB   57/64 KB   
20/383 KB   8/8 KB   61/64 KB   
24/383 KB   8/8 KB   61/64 KB   
24/383 KB   8/8 KB   64/64 KB   
28/383 KB   8/8 KB   64/64 KB   
32/383 KB   8/8 KB   64/64 KB   
36/383 KB   8/8 KB   64/64 KB   
40/383 KB   8/8 KB   64/64 KB   
44/383 KB   8/8 KB   64/64 KB   
48/383 KB   8/8 KB   64/64 KB   
52/383 KB   8/8 KB   64/64 KB   
56/383 KB   8/8 KB   64/64 KB   
60/383 KB   8/8 KB   64/64 KB   
64/383 KB   8/8 KB   64/64 KB   
68/383 KB   8/8 KB   64/64 KB   
72/383 KB   8/8 KB   64/64 KB   
76/383 KB   8/8 KB   64/64 KB   
80/383 KB   8/8 KB   64/64 KB   
84/383 KB   8/8 KB   64/64 KB   
88/383 KB   8/8 KB   64/64 KB   
92/383 KB   8/8 KB   64/64 KB   
96/383 KB   8/8 KB   64/64 KB   
100/383 KB   8/8 KB   64/64 KB   
104/383 KB   8/8 KB   64/64 KB   
108/383 KB   8/8 KB   64/64 KB   
112/383 KB   8/8 KB   64/64 KB   
                                 
Downloaded: http://repo.maven.apache.org/maven2/org/codehaus/plexus/plexus-velocity/1.1.7/plexus-velocity-1.1.7.jar
(8 KB at 267.4 KB/sec)
116/383 KB   64/64 KB            
120/383 KB   64/64 KB   
124/383 KB   64/64 KB   
128/383 KB   64/64 KB   
132/383 KB   64/64 KB   
136/383 KB   64/64 KB   
140/383 KB   64/64 KB   
144/383 KB   64/64 KB   
148/383 KB   64/64 KB   
152/383 KB   64/64 KB   
156/383 KB   64/64 KB   
160/383 KB   64/64 KB   
164/383 KB   64/64 KB   
168/383 KB   64/64 KB   
172/383 KB   64/64 KB   
176/383 KB   64/64 KB   
180/383 KB   64/64 KB   
184/383 KB   64/64 KB   
188/383 KB   64/64 KB   
192/383 KB   64/64 KB   
196/383 KB   64/64 KB   
200/383 KB   64/64 KB   
204/383 KB   64/64 KB   
208/383 KB   64/64 KB   
212/383 KB   64/64 KB   
216/383 KB   64/64 KB   
220/383 KB   64/64 KB   
224/383 KB   64/64 KB   
228/383 KB   64/64 KB   
232/383 KB   64/64 KB   
236/383 KB   64/64 KB   
240/383 KB   64/64 KB   
244/383 KB   64/64 KB   
248/383 KB   64/64 KB   
252/383 KB   64/64 KB   
256/383 KB   64/64 KB   
260/383 KB   64/64 KB   
264/383 KB   64/64 KB   
268/383 KB   64/64 KB   
272/383 KB   64/64 KB   
276/383 KB   64/64 KB   
280/383 KB   64/64 KB   
284/383 KB   64/64 KB   
288/383 KB   64/64 KB   
292/383 KB   64/64 KB   
296/383 KB   64/64 KB   
300/383 KB   64/64 KB   
304/383 KB   64/64 KB   
1/11 KB   304/383 KB   64/64 KB   
1/11 KB   308/383 KB   64/64 KB   
5/11 KB   308/383 KB   64/64 KB   
5/11 KB   312/383 KB   64/64 KB   
9/11 KB   312/383 KB   64/64 KB   
11/11 KB   312/383 KB   64/64 KB   
11/11 KB   312/383 KB   64/64 KB   4/227 KB   
11/11 KB   312/383 KB   64/64 KB   8/227 KB   
11/11 KB   312/383 KB   64/64 KB   12/227 KB   
11/11 KB   312/383 KB   64/64 KB   16/227 KB   
11/11 KB   312/383 KB   64/64 KB   20/227 KB   
11/11 KB   312/383 KB   64/64 KB   24/227 KB   
11/11 KB   312/383 KB   64/64 KB   28/227 KB   
11/11 KB   312/383 KB   64/64 KB   32/227 KB   
11/11 KB   312/383 KB   64/64 KB   36/227 KB   
11/11 KB   312/383 KB   64/64 KB   40/227 KB   
11/11 KB   312/383 KB   64/64 KB   44/227 KB   
11/11 KB   312/383 KB   64/64 KB   48/227 KB   
11/11 KB   312/383 KB   64/64 KB   52/227 KB   
11/11 KB   312/383 KB   64/64 KB   56/227 KB   
11/11 KB   312/383 KB   64/64 KB   60/227 KB   
11/11 KB   312/383 KB   64/64 KB   64/227 KB   
11/11 KB   312/383 KB   64/64 KB   68/227 KB   
11/11 KB   312/383 KB   64/64 KB   72/227 KB   
11/11 KB   312/383 KB   64/64 KB   76/227 KB   
11/11 KB   312/383 KB   64/64 KB   80/227 KB   
11/11 KB   312/383 KB   64/64 KB   84/227 KB   
11/11 KB   312/383 KB   64/64 KB   88/227 KB   
11/11 KB   312/383 KB   64/64 KB   92/227 KB   
11/11 KB   312/383 KB   64/64 KB   96/227 KB   
11/11 KB   312/383 KB   64/64 KB   100/227 KB   
11/11 KB   312/383 KB   64/64 KB   104/227 KB   
11/11 KB   312/383 KB   64/64 KB   108/227 KB   
11/11 KB   312/383 KB   64/64 KB   112/227 KB   
11/11 KB   312/383 KB   64/64 KB   116/227 KB   
11/11 KB   312/383 KB   64/64 KB   120/227 KB   
11/11 KB   312/383 KB   64/64 KB   124/227 KB   
11/11 KB   312/383 KB   64/64 KB   128/227 KB   
11/11 KB   312/383 KB   64/64 KB   132/227 KB   
11/11 KB   312/383 KB   64/64 KB   136/227 KB   
11/11 KB   312/383 KB   64/64 KB   140/227 KB   
11/11 KB   312/383 KB   64/64 KB   144/227 KB   
11/11 KB   312/383 KB   64/64 KB   148/227 KB   
11/11 KB   312/383 KB   64/64 KB   152/227 KB   
11/11 KB   312/383 KB   64/64 KB   156/227 KB   
11/11 KB   312/383 KB   64/64 KB   160/227 KB   
11/11 KB   312/383 KB   64/64 KB   164/227 KB   
11/11 KB   312/383 KB   64/64 KB   168/227 KB   
11/11 KB   312/383 KB   64/64 KB   172/227 KB   
11/11 KB   312/383 KB   64/64 KB   176/227 KB   
11/11 KB   312/383 KB   64/64 KB   180/227 KB   
11/11 KB   312/383 KB   64/64 KB   184/227 KB   
11/11 KB   312/383 KB   64/64 KB   188/227 KB   
11/11 KB   312/383 KB   64/64 KB   192/227 KB   
11/11 KB   312/383 KB   64/64 KB   196/227 KB   
11/11 KB   312/383 KB   64/64 KB   200/227 KB   
11/11 KB   312/383 KB   64/64 KB   204/227 KB   
11/11 KB   312/383 KB   64/64 KB   208/227 KB   
11/11 KB   312/383 KB   64/64 KB   212/227 KB   
11/11 KB   312/383 KB   64/64 KB   216/227 KB   
11/11 KB   312/383 KB   64/64 KB   220/227 KB   
11/11 KB   312/383 KB   64/64 KB   224/227 KB   
11/11 KB   312/383 KB   64/64 KB   227/227 KB   
11/11 KB   316/383 KB   64/64 KB   227/227 KB   
11/11 KB   320/383 KB   64/64 KB   227/227 KB   
11/11 KB   324/383 KB   64/64 KB   227/227 KB   
11/11 KB   328/383 KB   64/64 KB   227/227 KB   
11/11 KB   332/383 KB   64/64 KB   227/227 KB   
11/11 KB   336/383 KB   64/64 KB   227/227 KB   
11/11 KB   340/383 KB   64/64 KB   227/227 KB   
11/11 KB   344/383 KB   64/64 KB   227/227 KB   
11/11 KB   348/383 KB   64/64 KB   227/227 KB   
                                                
Downloaded: http://repo.maven.apache.org/maven2/oro/oro/2.0.8/oro-2.0.8.jar (64 KB at 2124.4
KB/sec)
11/11 KB   352/383 KB   227/227 KB              
11/11 KB   356/383 KB   227/227 KB   
11/11 KB   360/383 KB   227/227 KB   
11/11 KB   364/383 KB   227/227 KB   
11/11 KB   368/383 KB   227/227 KB   
11/11 KB   372/383 KB   227/227 KB   
11/11 KB   376/383 KB   227/227 KB   
11/11 KB   380/383 KB   227/227 KB   
11/11 KB   383/383 KB   227/227 KB   
                                     
Downloaded: http://repo.maven.apache.org/maven2/org/apache/maven/reporting/maven-reporting-api/3.0/maven-reporting-api-3.0.jar
(11 KB at 410.9 KB/sec)
                                     
Downloaded: http://repo.maven.apache.org/maven2/org/codehaus/plexus/plexus-utils/3.0.8/plexus-utils-3.0.8.jar
(227 KB at 7074.6 KB/sec)
                                     
Downloaded: http://repo.maven.apache.org/maven2/org/apache/velocity/velocity/1.5/velocity-1.5.jar
(383 KB at 8509.6 KB/sec)
[INFO] ------------------------------------------------------------------------
[INFO] Reactor Summary:
[INFO] 
[INFO] Apache Hama parent POM ............................ FAILURE [15.096s]
[INFO] pipes ............................................. SKIPPED
[INFO] commons ........................................... SKIPPED
[INFO] core .............................................. SKIPPED
[INFO] graph ............................................. SKIPPED
[INFO] machine learning .................................. SKIPPED
[INFO] examples .......................................... SKIPPED
[INFO] hama-dist ......................................... SKIPPED
[INFO] ------------------------------------------------------------------------
[INFO] BUILD FAILURE
[INFO] ------------------------------------------------------------------------
[INFO] Total time: 16.831s
[INFO] Finished at: Tue Feb 25 00:46:06 UTC 2014
[INFO] Final Memory: 15M/146M
[INFO] ------------------------------------------------------------------------
[ERROR] Failed to execute goal org.apache.rat:apache-rat-plugin:0.10:check (default) on project
hama-parent: Execution default of goal org.apache.rat:apache-rat-plugin:0.10:check failed:
Plugin org.apache.rat:apache-rat-plugin:0.10 or one of its dependencies could not be resolved:
The following artifacts could not be resolved: commons-collections:commons-collections:jar:3.2.1,
commons-lang:commons-lang:jar:2.6, commons-cli:commons-cli:jar:1.2, commons-logging:commons-logging:jar:1.1.1:
Could not find artifact commons-collections:commons-collections:jar:3.2.1 -> [Help 1]
[ERROR] 
[ERROR] To see the full stack trace of the errors, re-run Maven with the -e switch.
[ERROR] Re-run Maven using the -X switch to enable full debug logging.
[ERROR] 
[ERROR] For more information about the errors and possible solutions, please read the following
articles:
[ERROR] [Help 1] http://cwiki.apache.org/confluence/display/MAVEN/PluginResolutionException
Build step 'Invoke top-level Maven targets' marked build as failure
Archiving artifacts
Recording test results

Mime
View raw message