hama-dev mailing list archives

Site index · List index
Message view « Date » · « Thread »
Top « Date » · « Thread »
From Apache Jenkins Server <jenk...@builds.apache.org>
Subject Build failed in Jenkins: Hama-Nightly-for-Hadoop-1.x #1192
Date Tue, 25 Feb 2014 00:52:59 GMT
See <https://builds.apache.org/job/Hama-Nightly-for-Hadoop-1.x/1192/>

------------------------------------------
[...truncated 103085 lines...]
14/02/25 00:52:29 INFO kmeans.KMeansBSP: Finished! Writing the assignments...

14/02/25 00:52:29 INFO kmeans.KMeansBSP: Done.

14/02/25 00:52:29 INFO kmeans.KMeansBSP: Finished! Writing the assignments...

14/02/25 00:52:29 INFO kmeans.KMeansBSP: Done.

14/02/25 00:52:29 INFO kmeans.KMeansBSP: Finished! Writing the assignments...

14/02/25 00:52:29 INFO kmeans.KMeansBSP: Done.

14/02/25 00:52:32 INFO bsp.BSPJobClient: Current supersteps number: 1

14/02/25 00:52:32 INFO bsp.BSPJobClient: The total number of supersteps: 1

14/02/25 00:52:32 INFO bsp.BSPJobClient: Counters: 10

14/02/25 00:52:32 INFO bsp.BSPJobClient:   org.apache.hama.bsp.JobInProgress$JobCounter

14/02/25 00:52:32 INFO bsp.BSPJobClient:     SUPERSTEPS=1

14/02/25 00:52:32 INFO bsp.BSPJobClient:     LAUNCHED_TASKS=3

14/02/25 00:52:32 INFO bsp.BSPJobClient:   org.apache.hama.bsp.BSPPeerImpl$PeerCounter

14/02/25 00:52:32 INFO bsp.BSPJobClient:     SUPERSTEP_SUM=6

14/02/25 00:52:32 INFO bsp.BSPJobClient:     MESSAGE_BYTES_TRANSFERED=522

14/02/25 00:52:32 INFO bsp.BSPJobClient:     IO_BYTES_READ=8787

14/02/25 00:52:32 INFO bsp.BSPJobClient:     TIME_IN_SYNC_MS=25

14/02/25 00:52:32 INFO bsp.BSPJobClient:     TOTAL_MESSAGES_SENT=18

14/02/25 00:52:32 INFO bsp.BSPJobClient:     TASK_INPUT_RECORDS=303

14/02/25 00:52:32 INFO bsp.BSPJobClient:     TOTAL_MESSAGES_RECEIVED=18

14/02/25 00:52:32 INFO bsp.BSPJobClient:     TASK_OUTPUT_RECORDS=101

{0=[50.0, 50.0]}
Partition 0: from 0 to 24
Partition 1: from 25 to 49
Partition 2: from 50 to 74
Partition 3: from 75 to 100
14/02/25 00:52:32 INFO bsp.FileInputFormat: Total input paths to process : 4

14/02/25 00:52:32 WARN bsp.BSPJobClient: No job jar file set.  User classes may not be found.
See BSPJob#setJar(String) or check Your jar file.

14/02/25 00:52:32 INFO bsp.LocalBSPRunner: Setting up a new barrier for 4 tasks!

14/02/25 00:52:32 INFO bsp.BSPJobClient: Running job: job_localrunner_0001

14/02/25 00:52:32 INFO kmeans.KMeansBSP: Finished! Writing the assignments...

14/02/25 00:52:32 INFO kmeans.KMeansBSP: Finished! Writing the assignments...

14/02/25 00:52:32 INFO kmeans.KMeansBSP: Finished! Writing the assignments...

14/02/25 00:52:32 INFO kmeans.KMeansBSP: Finished! Writing the assignments...

14/02/25 00:52:32 INFO kmeans.KMeansBSP: Done.

14/02/25 00:52:32 INFO kmeans.KMeansBSP: Done.

14/02/25 00:52:32 INFO kmeans.KMeansBSP: Done.

14/02/25 00:52:32 INFO kmeans.KMeansBSP: Done.

14/02/25 00:52:35 INFO bsp.BSPJobClient: Current supersteps number: 1

14/02/25 00:52:35 INFO bsp.BSPJobClient: The total number of supersteps: 1

14/02/25 00:52:35 INFO bsp.BSPJobClient: Counters: 10

14/02/25 00:52:35 INFO bsp.BSPJobClient:   org.apache.hama.bsp.JobInProgress$JobCounter

14/02/25 00:52:35 INFO bsp.BSPJobClient:     SUPERSTEPS=1

14/02/25 00:52:35 INFO bsp.BSPJobClient:     LAUNCHED_TASKS=4

14/02/25 00:52:35 INFO bsp.BSPJobClient:   org.apache.hama.bsp.BSPPeerImpl$PeerCounter

14/02/25 00:52:35 INFO bsp.BSPJobClient:     SUPERSTEP_SUM=8

14/02/25 00:52:35 INFO bsp.BSPJobClient:     MESSAGE_BYTES_TRANSFERED=928

14/02/25 00:52:35 INFO bsp.BSPJobClient:     IO_BYTES_READ=8787

14/02/25 00:52:35 INFO bsp.BSPJobClient:     TIME_IN_SYNC_MS=13

14/02/25 00:52:35 INFO bsp.BSPJobClient:     TOTAL_MESSAGES_SENT=32

14/02/25 00:52:35 INFO bsp.BSPJobClient:     TASK_INPUT_RECORDS=303

14/02/25 00:52:35 INFO bsp.BSPJobClient:     TOTAL_MESSAGES_RECEIVED=32

14/02/25 00:52:35 INFO bsp.BSPJobClient:     TASK_OUTPUT_RECORDS=101

{0=[50.0, 50.0]}
Tests run: 1, Failures: 0, Errors: 0, Skipped: 0, Time elapsed: 0.008 sec
Killed
Running org.apache.hama.ml.regression.LogisticRegressionModelTest
Tests run: 3, Failures: 0, Errors: 0, Skipped: 0, Time elapsed: 0.01 sec
Running org.apache.hama.ml.regression.VectorDoubleFileInputFormatTest
14/02/25 00:52:43 WARN util.NativeCodeLoader: Unable to load native-hadoop library for your
platform... using builtin-java classes where applicable

14/02/25 00:52:43 WARN snappy.LoadSnappy: Snappy native library not loaded

Tests run: 1, Failures: 0, Errors: 0, Skipped: 0, Time elapsed: 0.009 sec
Running org.apache.hama.ml.perception.TestSmallMLPMessage
14/02/25 00:52:44 WARN util.NativeCodeLoader: Unable to load native-hadoop library for your
platform... using builtin-java classes where applicable

Tests run: 2, Failures: 0, Errors: 0, Skipped: 0, Time elapsed: 0.01 sec
Running org.apache.hama.ml.recommendation.TestOnlineCF
14/02/25 00:52:45 WARN util.NativeCodeLoader: Unable to load native-hadoop library for your
platform... using builtin-java classes where applicable

14/02/25 00:52:45 INFO bsp.FileInputFormat: Total input paths to process : 1

14/02/25 00:52:45 INFO bsp.FileInputFormat: Total input paths to process : 1

14/02/25 00:52:45 WARN bsp.BSPJobClient: No job jar file set.  User classes may not be found.
See BSPJob#setJar(String) or check Your jar file.

14/02/25 00:52:46 INFO bsp.BSPJobClient: Running job: job_localrunner_0001

14/02/25 00:52:46 INFO bsp.LocalBSPRunner: Setting up a new barrier for 1 tasks!

14/02/25 00:52:49 INFO bsp.BSPJobClient: Current supersteps number: 1

14/02/25 00:52:49 INFO bsp.BSPJobClient: The total number of supersteps: 1

14/02/25 00:52:49 INFO bsp.BSPJobClient: Counters: 6

14/02/25 00:52:49 INFO bsp.BSPJobClient:   org.apache.hama.bsp.JobInProgress$JobCounter

14/02/25 00:52:49 INFO bsp.BSPJobClient:     SUPERSTEPS=1

14/02/25 00:52:49 INFO bsp.BSPJobClient:     LAUNCHED_TASKS=1

14/02/25 00:52:49 INFO bsp.BSPJobClient:   org.apache.hama.bsp.BSPPeerImpl$PeerCounter

14/02/25 00:52:49 INFO bsp.BSPJobClient:     SUPERSTEP_SUM=2

14/02/25 00:52:49 INFO bsp.BSPJobClient:     IO_BYTES_READ=416

14/02/25 00:52:49 INFO bsp.BSPJobClient:     TIME_IN_SYNC_MS=0

14/02/25 00:52:49 INFO bsp.BSPJobClient:     TASK_INPUT_RECORDS=13

14/02/25 00:52:49 INFO bsp.FileInputFormat: Total input paths to process : 2

14/02/25 00:52:49 WARN bsp.BSPJobClient: No job jar file set.  User classes may not be found.
See BSPJob#setJar(String) or check Your jar file.

14/02/25 00:52:49 INFO bsp.LocalBSPRunner: Setting up a new barrier for 2 tasks!

14/02/25 00:52:49 INFO bsp.BSPJobClient: Running job: job_localrunner_0001

14/02/25 00:52:49 INFO cf.OnlineTrainBSP: local:0) collecting input data

14/02/25 00:52:49 INFO cf.OnlineTrainBSP: local:1) collecting input data

14/02/25 00:52:49 INFO cf.OnlineTrainBSP: local:1) collected: 1 users, 5 items, 5 preferences

14/02/25 00:52:49 INFO cf.OnlineTrainBSP: local:0) collected: 2 users, 5 items, 8 preferences

14/02/25 00:52:49 INFO cf.OnlineTrainBSP: local:0) saving 2 users

14/02/25 00:52:49 INFO cf.OnlineTrainBSP: local:1) saving 1 users

14/02/25 00:52:49 INFO cf.OnlineTrainBSP: local:0) saving 2 items

14/02/25 00:52:49 INFO cf.OnlineTrainBSP: local:1) saving 3 items

14/02/25 00:52:52 INFO bsp.BSPJobClient: Current supersteps number: 602

14/02/25 00:52:52 INFO bsp.BSPJobClient: The total number of supersteps: 602

14/02/25 00:52:52 INFO bsp.BSPJobClient: Counters: 10

14/02/25 00:52:52 INFO bsp.BSPJobClient:   org.apache.hama.bsp.JobInProgress$JobCounter

14/02/25 00:52:52 INFO bsp.BSPJobClient:     SUPERSTEPS=602

14/02/25 00:52:52 INFO bsp.BSPJobClient:     LAUNCHED_TASKS=2

14/02/25 00:52:52 INFO bsp.BSPJobClient:   org.apache.hama.bsp.BSPPeerImpl$PeerCounter

14/02/25 00:52:52 INFO bsp.BSPJobClient:     SUPERSTEP_SUM=1206

14/02/25 00:52:52 INFO bsp.BSPJobClient:     MESSAGE_BYTES_TRANSFERED=292020

14/02/25 00:52:52 INFO bsp.BSPJobClient:     IO_BYTES_READ=416

14/02/25 00:52:52 INFO bsp.BSPJobClient:     TIME_IN_SYNC_MS=411

14/02/25 00:52:52 INFO bsp.BSPJobClient:     TOTAL_MESSAGES_SENT=3010

14/02/25 00:52:52 INFO bsp.BSPJobClient:     TASK_INPUT_RECORDS=13

14/02/25 00:52:52 INFO bsp.BSPJobClient:     TOTAL_MESSAGES_RECEIVED=3010

14/02/25 00:52:52 INFO bsp.BSPJobClient:     TASK_OUTPUT_RECORDS=8

14/02/25 00:52:52 INFO cf.OnlineCF: loading model from onlinecf_model1517

14/02/25 00:52:52 INFO cf.OnlineCF: loaded: 3 users, 0 user features, 5 items, 0 item feature
values

Tests run: 1, Failures: 0, Errors: 0, Skipped: 0, Time elapsed: 0.007 sec

Results :

Tests run: 29, Failures: 0, Errors: 0, Skipped: 0

[INFO] ------------------------------------------------------------------------
[INFO] Reactor Summary:
[INFO] 
[INFO] Apache Hama parent POM ............................ SUCCESS [7.456s]
[INFO] pipes ............................................. SUCCESS [18.035s]
[INFO] commons ........................................... SUCCESS [8.719s]
[INFO] core .............................................. SUCCESS [3:08.987s]
[INFO] graph ............................................. SUCCESS [22.038s]
[INFO] machine learning .................................. FAILURE [1:41.046s]
[INFO] examples .......................................... SKIPPED
[INFO] hama-dist ......................................... SKIPPED
[INFO] ------------------------------------------------------------------------
[INFO] BUILD FAILURE
[INFO] ------------------------------------------------------------------------
[INFO] Total time: 5:47.513s
[INFO] Finished at: Tue Feb 25 00:52:52 UTC 2014
[INFO] Final Memory: 86M/574M
[INFO] ------------------------------------------------------------------------
[ERROR] Failed to execute goal org.apache.maven.plugins:maven-surefire-plugin:2.6:test (default-test)
on project hama-ml: There are test failures.
[ERROR] 
[ERROR] Please refer to <https://builds.apache.org/job/Hama-Nightly-for-Hadoop-1.x/ws/trunk/ml/target/surefire-reports>
for the individual test results.
[ERROR] -> [Help 1]
[ERROR] 
[ERROR] To see the full stack trace of the errors, re-run Maven with the -e switch.
[ERROR] Re-run Maven using the -X switch to enable full debug logging.
[ERROR] 
[ERROR] For more information about the errors and possible solutions, please read the following
articles:
[ERROR] [Help 1] http://cwiki.apache.org/confluence/display/MAVEN/MojoFailureException
[ERROR] 
[ERROR] After correcting the problems, you can resume the build with the command
[ERROR]   mvn <goals> -rf :hama-ml
Build step 'Invoke top-level Maven targets' marked build as failure
Archiving artifacts
Recording test results

Mime
View raw message