hama-dev mailing list archives

Site index · List index
Message view « Date » · « Thread »
Top « Date » · « Thread »
From Apache Jenkins Server <jenk...@builds.apache.org>
Subject Build failed in Jenkins: Hama-Nightly-for-Hadoop-2.x #136
Date Fri, 03 Jan 2014 00:21:59 GMT
See <https://builds.apache.org/job/Hama-Nightly-for-Hadoop-2.x/136/>

------------------------------------------
[...truncated 104495 lines...]
[7.10203508408036, -4.279670186149137, 5.422083748
402708, 4.792113564533352, 2.9861216440626746, -0.9197892138069559, -0.541835138835484]	4.792011704063929
[7.094064149371662, -4.309408625114272, 5.412141869325169, 4.778229824554746, 2.964266980841808,
-0.9456148394991056, -0.5756316615194502]	4.570228216084243
[7.086130978849286, -4.338807201271834, 5.402275517130851, 4.7644971285507856, 2.94260112270095,
-0.9712138933828114, -0.6091638550517424]	4.35070477467997
[7.078279787575417, -4.367467991903288, 5.392573118458076, 4.751092332714601, 2.9213451436250497,
-0.9963210944084716, -0.6421222134455117]	4.136204544458424
[7.070590165967807, -4.394674703108866, 5.383193849479623, 4.738333790121049, 2.900896989537819,
-1.0204589152235353, -0.6739496088942645]	3.9320992443258813
[7.063167338947803, -4.419480340330619, 5.374348153444877, 4.72664238634335, 2.881782773619096,
-1.0429960293855516, -0.7039094777967867]	3.746724152620719
[7.0560842347812, -4.441228589854085, 5.366181878052325, 4.716309814532597, 2.864367120496723,
-1.0634948990816013, -0.7314913386809223]	3.5882736744855825
[7.0560842347812, -4.441228589854085, 5.366181878052325, 4.716309814532597, 2.864367120496723,
-1.0634948990816013, -0.7314913386809223]	3.458803849984058

Job Finished in 3.228 seconds
Tests run: 1, Failures: 0, Errors: 0, Skipped: 0, Time elapsed: 0.01 sec
Running org.apache.hama.examples.BipartiteMatchingTest
14/01/03 00:20:47 WARN util.NativeCodeLoader: Unable to load native-hadoop library for your
platform... using builtin-java classes where applicable

14/01/03 00:20:47 INFO bsp.FileInputFormat: Total input paths to process : 1

14/01/03 00:20:47 WARN snappy.LoadSnappy: Snappy native library not loaded

14/01/03 00:20:47 INFO bsp.FileInputFormat: Total input paths to process : 1

14/01/03 00:20:47 WARN bsp.BSPJobClient: No job jar file set.  User classes may not be found.
See BSPJob#setJar(String) or check Your jar file.

14/01/03 00:20:47 INFO bsp.BSPJobClient: Running job: job_localrunner_0001

14/01/03 00:20:47 INFO bsp.LocalBSPRunner: Setting up a new barrier for 1 tasks!

14/01/03 00:20:50 INFO bsp.BSPJobClient: Current supersteps number: 1

14/01/03 00:20:50 INFO bsp.BSPJobClient: The total number of supersteps: 1

14/01/03 00:20:50 INFO bsp.BSPJobClient: Counters: 6

14/01/03 00:20:50 INFO bsp.BSPJobClient:   org.apache.hama.bsp.JobInProgress$JobCounter

14/01/03 00:20:50 INFO bsp.BSPJobClient:     SUPERSTEPS=1

14/01/03 00:20:50 INFO bsp.BSPJobClient:     LAUNCHED_TASKS=1

14/01/03 00:20:50 INFO bsp.BSPJobClient:   org.apache.hama.bsp.BSPPeerImpl$PeerCounter

14/01/03 00:20:50 INFO bsp.BSPJobClient:     SUPERSTEP_SUM=2

14/01/03 00:20:50 INFO bsp.BSPJobClient:     IO_BYTES_READ=32

14/01/03 00:20:50 INFO bsp.BSPJobClient:     TIME_IN_SYNC_MS=0

14/01/03 00:20:50 INFO bsp.BSPJobClient:     TASK_INPUT_RECORDS=4

14/01/03 00:20:50 INFO bsp.FileInputFormat: Total input paths to process : 2

14/01/03 00:20:50 WARN bsp.BSPJobClient: No job jar file set.  User classes may not be found.
See BSPJob#setJar(String) or check Your jar file.

14/01/03 00:20:50 INFO bsp.LocalBSPRunner: Setting up a new barrier for 2 tasks!

14/01/03 00:20:50 INFO bsp.BSPJobClient: Running job: job_localrunner_0001

14/01/03 00:20:50 INFO graph.GraphJobRunner: 2 vertices are loaded into local:0

14/01/03 00:20:50 INFO graph.GraphJobRunner: 2 vertices are loaded into local:1

14/01/03 00:20:53 INFO bsp.BSPJobClient: Current supersteps number: 7

14/01/03 00:20:53 INFO bsp.BSPJobClient: The total number of supersteps: 7

14/01/03 00:20:53 INFO bsp.BSPJobClient: Counters: 11

14/01/03 00:20:53 INFO bsp.BSPJobClient:   org.apache.hama.graph.GraphJobRunner$GraphJobCounter

14/01/03 00:20:53 INFO bsp.BSPJobClient:     ITERATIONS=6

14/01/03 00:20:53 INFO bsp.BSPJobClient:     INPUT_VERTICES=4

14/01/03 00:20:53 INFO bsp.BSPJobClient:   org.apache.hama.bsp.JobInProgress$JobCounter

14/01/03 00:20:53 INFO bsp.BSPJobClient:     SUPERSTEPS=7

14/01/03 00:20:53 INFO bsp.BSPJobClient:     LAUNCHED_TASKS=2

14/01/03 00:20:53 INFO bsp.BSPJobClient:   org.apache.hama.bsp.BSPPeerImpl$PeerCounter

14/01/03 00:20:53 INFO bsp.BSPJobClient:     SUPERSTEP_SUM=16

14/01/03 00:20:53 INFO bsp.BSPJobClient:     IO_BYTES_READ=96

14/01/03 00:20:53 INFO bsp.BSPJobClient:     TIME_IN_SYNC_MS=25

14/01/03 00:20:53 INFO bsp.BSPJobClient:     TOTAL_MESSAGES_SENT=40

14/01/03 00:20:53 INFO bsp.BSPJobClient:     TASK_INPUT_RECORDS=4

14/01/03 00:20:53 INFO bsp.BSPJobClient:     TOTAL_MESSAGES_RECEIVED=38

14/01/03 00:20:53 INFO bsp.BSPJobClient:     TASK_OUTPUT_RECORDS=4

Job Finished in 6.514 seconds
A -> D L expvalue = D L
C -> B L expvalue = B L
B -> C R expvalue = C R
D -> A R expvalue = A R
Tests run: 1, Failures: 0, Errors: 0, Skipped: 0, Time elapsed: 0.008 sec
Running org.apache.hama.examples.SemiClusterMatchingTest
14/01/03 00:20:54 WARN util.NativeCodeLoader: Unable to load native-hadoop library for your
platform... using builtin-java classes where applicable

14/01/03 00:20:54 INFO bsp.FileInputFormat: Total input paths to process : 1

14/01/03 00:20:54 WARN snappy.LoadSnappy: Snappy native library not loaded

14/01/03 00:20:54 INFO bsp.FileInputFormat: Total input paths to process : 1

14/01/03 00:20:54 WARN bsp.BSPJobClient: No job jar file set.  User classes may not be found.
See BSPJob#setJar(String) or check Your jar file.

14/01/03 00:20:55 INFO bsp.BSPJobClient: Running job: job_localrunner_0001

14/01/03 00:20:55 INFO bsp.LocalBSPRunner: Setting up a new barrier for 1 tasks!

14/01/03 00:20:58 INFO bsp.BSPJobClient: Current supersteps number: 1

14/01/03 00:20:58 INFO bsp.BSPJobClient: The total number of supersteps: 1

14/01/03 00:20:58 INFO bsp.BSPJobClient: Counters: 6

14/01/03 00:20:58 INFO bsp.BSPJobClient:   org.apache.hama.bsp.JobInProgress$JobCounter

14/01/03 00:20:58 INFO bsp.BSPJobClient:     SUPERSTEPS=1

14/01/03 00:20:58 INFO bsp.BSPJobClient:     LAUNCHED_TASKS=1

14/01/03 00:20:58 INFO bsp.BSPJobClient:   org.apache.hama.bsp.BSPPeerImpl$PeerCounter

14/01/03 00:20:58 INFO bsp.BSPJobClient:     SUPERSTEP_SUM=2

14/01/03 00:20:58 INFO bsp.BSPJobClient:     IO_BYTES_READ=23990

14/01/03 00:20:58 INFO bsp.BSPJobClient:     TIME_IN_SYNC_MS=1

14/01/03 00:20:58 INFO bsp.BSPJobClient:     TASK_INPUT_RECORDS=300

14/01/03 00:20:58 INFO bsp.FileInputFormat: Total input paths to process : 1

14/01/03 00:20:58 WARN bsp.BSPJobClient: No job jar file set.  User classes may not be found.
See BSPJob#setJar(String) or check Your jar file.

14/01/03 00:20:58 INFO bsp.BSPJobClient: Running job: job_localrunner_0001

14/01/03 00:20:58 INFO bsp.LocalBSPRunner: Setting up a new barrier for 1 tasks!

14/01/03 00:20:58 INFO graph.GraphJobRunner: 300 vertices are loaded into local:0

14/01/03 00:21:01 INFO bsp.BSPJobClient: Current supersteps number: 3

14/01/03 00:21:04 INFO bsp.BSPJobClient: Current supersteps number: 4

14/01/03 00:21:07 INFO bsp.BSPJobClient: Current supersteps number: 5

14/01/03 00:21:13 INFO bsp.BSPJobClient: Current supersteps number: 6

14/01/03 00:21:16 INFO bsp.BSPJobClient: Current supersteps number: 7

14/01/03 00:21:19 INFO bsp.BSPJobClient: Current supersteps number: 8

14/01/03 00:21:22 INFO bsp.BSPJobClient: Current supersteps number: 9

14/01/03 00:21:25 INFO bsp.BSPJobClient: Current supersteps number: 10

14/01/03 00:21:28 INFO bsp.BSPJobClient: Current supersteps number: 11

14/01/03 00:21:31 INFO bsp.BSPJobClient: Current supersteps number: 12

14/01/03 00:21:34 INFO bsp.BSPJobClient: Current supersteps number: 13

14/01/03 00:21:37 INFO bsp.BSPJobClient: Current supersteps number: 14

14/01/03 00:21:40 INFO bsp.BSPJobClient: Current supersteps number: 15

14/01/03 00:21:43 INFO bsp.BSPJobClient: The total number of supersteps: 15

14/01/03 00:21:43 INFO bsp.BSPJobClient: Counters: 11

14/01/03 00:21:43 INFO bsp.BSPJobClient:   org.apache.hama.graph.GraphJobRunner$GraphJobCounter

14/01/03 00:21:43 INFO bsp.BSPJobClient:     ITERATIONS=15

14/01/03 00:21:43 INFO bsp.BSPJobClient:     INPUT_VERTICES=300

14/01/03 00:21:43 INFO bsp.BSPJobClient:   org.apache.hama.bsp.JobInProgress$JobCounter

14/01/03 00:21:43 INFO bsp.BSPJobClient:     SUPERSTEPS=15

14/01/03 00:21:43 INFO bsp.BSPJobClient:     LAUNCHED_TASKS=1

14/01/03 00:21:43 INFO bsp.BSPJobClient:   org.apache.hama.bsp.BSPPeerImpl$PeerCounter

14/01/03 00:21:43 INFO bsp.BSPJobClient:     SUPERSTEP_SUM=16

14/01/03 00:21:43 INFO bsp.BSPJobClient:     IO_BYTES_READ=29070

14/01/03 00:21:43 INFO bsp.BSPJobClient:     TIME_IN_SYNC_MS=5

14/01/03 00:21:43 INFO bsp.BSPJobClient:     TOTAL_MESSAGES_SENT=4699232

14/01/03 00:21:43 INFO bsp.BSPJobClient:     TASK_INPUT_RECORDS=300

14/01/03 00:21:43 INFO bsp.BSPJobClient:     TOTAL_MESSAGES_RECEIVED=4365930

14/01/03 00:21:43 INFO bsp.BSPJobClient:     TASK_OUTPUT_RECORDS=300

Job Finished in 48.487 seconds
Tests run: 1, Failures: 0, Errors: 0, Skipped: 0, Time elapsed: 0.007 sec

Results :

Failed tests: 

Tests run: 20, Failures: 1, Errors: 0, Skipped: 0

[INFO] ------------------------------------------------------------------------
[INFO] Reactor Summary:
[INFO] 
[INFO] Apache Hama parent POM ............................ SUCCESS [15.925s]
[INFO] pipes ............................................. SUCCESS [32.781s]
[INFO] commons ........................................... SUCCESS [15.958s]
[INFO] core .............................................. SUCCESS [3:47.980s]
[INFO] graph ............................................. SUCCESS [1:11.061s]
[INFO] machine learning .................................. SUCCESS [1:43.403s]
[INFO] examples .......................................... FAILURE [2:12.695s]
[INFO] hama-dist ......................................... SKIPPED
[INFO] ------------------------------------------------------------------------
[INFO] BUILD FAILURE
[INFO] ------------------------------------------------------------------------
[INFO] Total time: 10:00.763s
[INFO] Finished at: Fri Jan 03 00:21:43 UTC 2014
[INFO] Final Memory: 116M/262M
[INFO] ------------------------------------------------------------------------
[ERROR] Failed to execute goal org.apache.maven.plugins:maven-surefire-plugin:2.6:test (default-test)
on project hama-examples: There are test failures.
[ERROR] 
[ERROR] Please refer to <https://builds.apache.org/job/Hama-Nightly-for-Hadoop-2.x/ws/trunk/examples/target/surefire-reports>
for the individual test results.
[ERROR] -> [Help 1]
[ERROR] 
[ERROR] To see the full stack trace of the errors, re-run Maven with the -e switch.
[ERROR] Re-run Maven using the -X switch to enable full debug logging.
[ERROR] 
[ERROR] For more information about the errors and possible solutions, please read the following
articles:
[ERROR] [Help 1] http://cwiki.apache.org/confluence/display/MAVEN/MojoFailureException
[ERROR] 
[ERROR] After correcting the problems, you can resume the build with the command
[ERROR]   mvn <goals> -rf :hama-examples
Build step 'Invoke top-level Maven targets' marked build as failure
Archiving artifacts
Recording test results

Mime
View raw message