hama-dev mailing list archives

Site index · List index
Message view « Date » · « Thread »
Top « Date » · « Thread »
From Apache Jenkins Server <jenk...@builds.apache.org>
Subject Build failed in Jenkins: Hama-Nightly-for-Hadoop-1.x #1122
Date Sun, 15 Dec 2013 00:49:53 GMT
See <https://builds.apache.org/job/Hama-Nightly-for-Hadoop-1.x/1122/>

------------------------------------------
[...truncated 21407 lines...]
13/12/15 00:49:37 INFO pipes.TestPipes: value[9,1]: 35454.1979242028 expected: 35454.197924202796

13/12/15 00:49:37 INFO pipes.TestPipes: value[9,2]: 34285.15853148456 expected: 34285.15853148456

13/12/15 00:49:37 INFO pipes.TestPipes: value[9,3]: 36017.38099486754 expected: 36017.38099486754

13/12/15 00:49:37 INFO pipes.TestPipes: value[9,4]: 30404.08403466396 expected: 30404.084034663956

13/12/15 00:49:37 INFO pipes.TestPipes: value[9,5]: 34212.99680900574 expected: 34212.996809005745

13/12/15 00:49:37 INFO pipes.TestPipes: value[9,6]: 43750.32639272427 expected: 43750.326392724266

13/12/15 00:49:37 INFO pipes.TestPipes: value[9,7]: 38602.23261605099 expected: 38602.232616050984

13/12/15 00:49:37 INFO pipes.TestPipes: value[9,8]: 25896.49980168721 expected: 25896.49980168721

13/12/15 00:49:37 INFO pipes.TestPipes: value[9,9]: 21851.1887007519 expected: 21851.188700751896

13/12/15 00:49:37 INFO pipes.TestPipes: value[9,10]: 37558.7802339902 expected: 37558.78023399021

13/12/15 00:49:37 INFO pipes.TestPipes: value[9,11]: 45297.95070449685 expected: 45297.95070449685

13/12/15 00:49:37 INFO pipes.TestPipes: value[9,12]: 25537.21152997568 expected: 25537.211529975677

13/12/15 00:49:37 INFO pipes.TestPipes: key: 10 value: [31284.40256732453, 28734.30060574656,
19875.789688798, 24586.65885336562, 17951.09056365793, 22619.3339277884, 33324.67260792473,
24795.89695010563, 19636.05401294497, 12547.16776173803, 26060.12447300602, 24501.42996743495,
15335.39121843653]

13/12/15 00:49:37 INFO pipes.TestPipes: value[10,0]: 31284.40256732453 expected: 31284.40256732453

13/12/15 00:49:37 INFO pipes.TestPipes: value[10,1]: 28734.30060574656 expected: 28734.300605746565

13/12/15 00:49:37 INFO pipes.TestPipes: value[10,2]: 19875.789688798 expected: 19875.789688798002

13/12/15 00:49:37 INFO pipes.TestPipes: value[10,3]: 24586.65885336562 expected: 24586.658853365618

13/12/15 00:49:37 INFO pipes.TestPipes: value[10,4]: 17951.09056365793 expected: 17951.090563657934

13/12/15 00:49:37 INFO pipes.TestPipes: value[10,5]: 22619.3339277884 expected: 22619.333927788404

13/12/15 00:49:37 INFO pipes.TestPipes: value[10,6]: 33324.67260792473 expected: 33324.67260792473

13/12/15 00:49:37 INFO pipes.TestPipes: value[10,7]: 24795.89695010563 expected: 24795.896950105627

13/12/15 00:49:37 INFO pipes.TestPipes: value[10,8]: 19636.05401294497 expected: 19636.05401294497

13/12/15 00:49:37 INFO pipes.TestPipes: value[10,9]: 12547.16776173803 expected: 12547.167761738026

13/12/15 00:49:37 INFO pipes.TestPipes: value[10,10]: 26060.12447300602 expected: 26060.124473006017

13/12/15 00:49:37 INFO pipes.TestPipes: value[10,11]: 24501.42996743495 expected: 24501.429967434957

13/12/15 00:49:37 INFO pipes.TestPipes: value[10,12]: 15335.39121843653 expected: 15335.391218436529

13/12/15 00:49:37 INFO pipes.TestPipes: key: 11 value: [23567.03415695775, 17469.70403500747,
13858.21469262877, 18598.5810746282, 10346.8730384483, 13046.47777844706, 20051.48103030564,
16602.64751863425, 8494.387019089645, 10402.22760955733, 14884.19404323283, 19537.60792617007,
9870.681339453375]

13/12/15 00:49:37 INFO pipes.TestPipes: value[11,0]: 23567.03415695775 expected: 23567.034156957747

13/12/15 00:49:37 INFO pipes.TestPipes: value[11,1]: 17469.70403500747 expected: 17469.70403500748

13/12/15 00:49:37 INFO pipes.TestPipes: value[11,2]: 13858.21469262877 expected: 13858.214692628771

13/12/15 00:49:37 INFO pipes.TestPipes: value[11,3]: 18598.5810746282 expected: 18598.581074628204

13/12/15 00:49:37 INFO pipes.TestPipes: value[11,4]: 10346.8730384483 expected: 10346.873038448304

13/12/15 00:49:37 INFO pipes.TestPipes: value[11,5]: 13046.47777844706 expected: 13046.47777844706

13/12/15 00:49:37 INFO pipes.TestPipes: value[11,6]: 20051.48103030564 expected: 20051.48103030564

13/12/15 00:49:37 INFO pipes.TestPipes: value[11,7]: 16602.64751863425 expected: 16602.647518634247

13/12/15 00:49:37 INFO pipes.TestPipes: value[11,8]: 8494.387019089645 expected: 8494.387019089645

13/12/15 00:49:37 INFO pipes.TestPipes: value[11,9]: 10402.22760955733 expected: 10402.227609557329

13/12/15 00:49:37 INFO pipes.TestPipes: value[11,10]: 14884.19404323283 expected: 14884.194043232823

13/12/15 00:49:37 INFO pipes.TestPipes: value[11,11]: 19537.60792617007 expected: 19537.607926170072

13/12/15 00:49:37 INFO pipes.TestPipes: value[11,12]: 9870.681339453375 expected: 9870.681339453375

13/12/15 00:49:37 INFO pipes.TestPipes: key: 12 value: [41954.13924499479, 41534.18051169463,
29246.31530548493, 36428.73448381696, 33482.46387230168, 34786.5839565936, 40415.60140664427,
37154.17091835048, 24847.93809493572, 19253.33974176549, 39668.28790224533, 37543.76848793527,
20489.47895845412]

13/12/15 00:49:37 INFO pipes.TestPipes: value[12,0]: 41954.13924499479 expected: 41954.13924499479

13/12/15 00:49:37 INFO pipes.TestPipes: value[12,1]: 41534.18051169463 expected: 41534.18051169463

13/12/15 00:49:37 INFO pipes.TestPipes: value[12,2]: 29246.31530548493 expected: 29246.31530548493

13/12/15 00:49:37 INFO pipes.TestPipes: value[12,3]: 36428.73448381696 expected: 36428.73448381696

13/12/15 00:49:37 INFO pipes.TestPipes: value[12,4]: 33482.46387230168 expected: 33482.46387230168

13/12/15 00:49:37 INFO pipes.TestPipes: value[12,5]: 34786.5839565936 expected: 34786.583956593604

13/12/15 00:49:37 INFO pipes.TestPipes: value[12,6]: 40415.60140664427 expected: 40415.601406644266

13/12/15 00:49:37 INFO pipes.TestPipes: value[12,7]: 37154.17091835048 expected: 37154.17091835048

13/12/15 00:49:37 INFO pipes.TestPipes: value[12,8]: 24847.93809493572 expected: 24847.93809493572

13/12/15 00:49:37 INFO pipes.TestPipes: value[12,9]: 19253.33974176549 expected: 19253.339741765492

13/12/15 00:49:37 INFO pipes.TestPipes: value[12,10]: 39668.28790224533 expected: 39668.287902245334

13/12/15 00:49:37 INFO pipes.TestPipes: value[12,11]: 37543.76848793527 expected: 37543.768487935275

13/12/15 00:49:37 INFO pipes.TestPipes: value[12,12]: 20489.47895845412 expected: 20489.47895845412

13/12/15 00:49:37 INFO pipes.TestPipes: Output File: file:/tmp/test-example/testing/out/part-00002

13/12/15 00:49:37 INFO pipes.TestPipes: Output File: file:/tmp/test-example/testing/out/part-00000

13/12/15 00:49:37 INFO server.PrepRequestProcessor: Processed session termination for sessionid:
0x142f3ba87650000

13/12/15 00:49:37 INFO zookeeper.ZooKeeper: Session: 0x142f3ba87650000 closed

13/12/15 00:49:37 INFO zookeeper.ClientCnxn: EventThread shut down

13/12/15 00:49:37 INFO ipc.Server: Stopping server on 40000

13/12/15 00:49:37 INFO server.NIOServerCnxn: Closed socket connection for client /0:0:0:0:0:0:0:1:40877
which had sessionid 0x142f3ba87650000

13/12/15 00:49:37 INFO ipc.Server: Stopping IPC Server listener on 40000

13/12/15 00:49:37 INFO ipc.Server: IPC Server handler 0 on 40000: exiting

13/12/15 00:49:37 INFO bsp.BSPMaster: Stopped RPC Master server.

13/12/15 00:49:37 INFO ipc.Server: Stopping IPC Server Responder

13/12/15 00:49:37 INFO server.PrepRequestProcessor: Processed session termination for sessionid:
0x142f3ba87650001

13/12/15 00:49:37 INFO zookeeper.ZooKeeper: Session: 0x142f3ba87650001 closed

13/12/15 00:49:37 INFO zookeeper.ClientCnxn: EventThread shut down

13/12/15 00:49:37 INFO server.NIOServerCnxn: Closed socket connection for client /0:0:0:0:0:0:0:1:40878
which had sessionid 0x142f3ba87650001

13/12/15 00:49:37 INFO ipc.Server: Stopping server on 56345

13/12/15 00:49:37 INFO ipc.Server: IPC Server handler 0 on 56345: exiting

13/12/15 00:49:37 INFO ipc.Server: Stopping IPC Server listener on 56345

13/12/15 00:49:37 INFO ipc.Server: Stopping IPC Server Responder

13/12/15 00:49:37 INFO ipc.Server: Stopping server on 52432

13/12/15 00:49:37 INFO ipc.Server: IPC Server handler 0 on 52432: exiting

13/12/15 00:49:37 INFO ipc.Server: IPC Server handler 2 on 52432: exiting

13/12/15 00:49:37 INFO ipc.Server: Stopping IPC Server Responder

13/12/15 00:49:37 INFO server.NIOServerCnxnFactory: NIOServerCnxn factory exited run method

13/12/15 00:49:37 INFO ipc.Server: IPC Server handler 8 on 52432: exiting

13/12/15 00:49:37 INFO server.ZooKeeperServer: shutting down

13/12/15 00:49:37 INFO ipc.Server: IPC Server handler 9 on 52432: exiting

13/12/15 00:49:37 INFO server.SessionTrackerImpl: Shutting down

13/12/15 00:49:37 INFO ipc.Server: IPC Server handler 6 on 52432: exiting

13/12/15 00:49:37 INFO ipc.Server: IPC Server handler 7 on 52432: exiting

13/12/15 00:49:37 INFO ipc.Server: IPC Server handler 5 on 52432: exiting

13/12/15 00:49:37 INFO ipc.Server: IPC Server handler 4 on 52432: exiting

13/12/15 00:49:37 INFO ipc.Server: IPC Server handler 1 on 52432: exiting

13/12/15 00:49:37 INFO ipc.Server: Stopping IPC Server listener on 52432

13/12/15 00:49:37 INFO ipc.Server: IPC Server handler 3 on 52432: exiting

13/12/15 00:49:37 INFO server.PrepRequestProcessor: Shutting down

13/12/15 00:49:37 INFO server.SyncRequestProcessor: Shutting down

13/12/15 00:49:37 INFO server.PrepRequestProcessor: PrepRequestProcessor exited loop!

13/12/15 00:49:37 INFO server.SyncRequestProcessor: SyncRequestProcessor exited!

13/12/15 00:49:37 INFO server.FinalRequestProcessor: shutdown of request processor complete

Tests run: 1, Failures: 0, Errors: 0, Skipped: 0, Time elapsed: 0.019 sec
Running org.apache.hama.zookeeper.TestZKTools
Tests run: 1, Failures: 0, Errors: 0, Skipped: 0, Time elapsed: 0.01 sec
Running org.apache.hama.bsp.TestZooKeeper
13/12/15 00:49:38 ERROR quorum.QuorumPeerConfig: Invalid configuration, only one server specified
(ignoring)

13/12/15 00:49:38 INFO server.ZooKeeperServerMain: Starting server

13/12/15 00:49:38 INFO server.ZooKeeperServer: Server environment:zookeeper.version=3.4.5-1392090,
built on 09/30/2012 17:52 GMT

13/12/15 00:49:38 INFO server.ZooKeeperServer: Server environment:host.name=janus.apache.org

13/12/15 00:49:38 INFO server.ZooKeeperServer: Server environment:java.version=1.7.0_25

13/12/15 00:49:38 INFO server.ZooKeeperServer: Server environment:java.vendor=Oracle Corporation

13/12/15 00:49:38 INFO server.ZooKeeperServer: Server environment:java.home=/home/jenkins/tools/java/jdk1.7.0_25-32/jre

13/12/15 00:49:38 INFO server.ZooKeeperServer: Server environment:java.class.path=/tmp/surefirebooter5286645993633334119.jar


Results :

Failed tests: 

Tests run: 66, Failures: 1, Errors: 0, Skipped: 0

[INFO] ------------------------------------------------------------------------
[INFO] Reactor Summary:
[INFO] 
[INFO] Apache Hama parent POM ............................ SUCCESS [15.954s]
[INFO] pipes ............................................. SUCCESS [15.088s]
[INFO] commons ........................................... SUCCESS [6.804s]
[INFO] core .............................................. FAILURE [2:43.645s]
[INFO] graph ............................................. SKIPPED
[INFO] machine learning .................................. SKIPPED
[INFO] examples .......................................... SKIPPED
[INFO] hama-dist ......................................... SKIPPED
[INFO] ------------------------------------------------------------------------
[INFO] BUILD FAILURE
[INFO] ------------------------------------------------------------------------
[INFO] Total time: 3:22.995s
[INFO] Finished at: Sun Dec 15 00:49:50 UTC 2013
[INFO] Final Memory: 50M/211M
[INFO] ------------------------------------------------------------------------
[ERROR] Failed to execute goal org.apache.maven.plugins:maven-surefire-plugin:2.6:test (default-test)
on project hama-core: There are test failures.
[ERROR] 
[ERROR] Please refer to <https://builds.apache.org/job/Hama-Nightly-for-Hadoop-1.x/ws/trunk/core/target/surefire-reports>
for the individual test results.
[ERROR] -> [Help 1]
[ERROR] 
[ERROR] To see the full stack trace of the errors, re-run Maven with the -e switch.
[ERROR] Re-run Maven using the -X switch to enable full debug logging.
[ERROR] 
[ERROR] For more information about the errors and possible solutions, please read the following
articles:
[ERROR] [Help 1] http://cwiki.apache.org/confluence/display/MAVEN/MojoFailureException
[ERROR] 
[ERROR] After correcting the problems, you can resume the build with the command
[ERROR]   mvn <goals> -rf :hama-core
Build step 'Invoke top-level Maven targets' marked build as failure
Archiving artifacts
Recording test results

Mime
View raw message