hama-dev mailing list archives

Site index · List index
Message view « Date » · « Thread »
Top « Date » · « Thread »
From Apache Jenkins Server <jenk...@builds.apache.org>
Subject Build failed in Jenkins: Hama-Nightly-for-Hadoop-2.x #98
Date Thu, 21 Nov 2013 10:31:55 GMT
See <https://builds.apache.org/job/Hama-Nightly-for-Hadoop-2.x/98/>

------------------------------------------
[...truncated 22407 lines...]

13/11/21 10:31:39 INFO bsp.BSPJobClient: Current supersteps number: 14

13/11/21 10:31:39 INFO bsp.BSPJobClient: The total number of supersteps: 14

13/11/21 10:31:39 INFO bsp.BSPJobClient: Counters: 7

13/11/21 10:31:39 INFO bsp.BSPJobClient:   org.apache.hama.bsp.JobInProgress$JobCounter

13/11/21 10:31:39 INFO bsp.BSPJobClient:     SUPERSTEPS=14

13/11/21 10:31:39 INFO bsp.BSPJobClient:     LAUNCHED_TASKS=3

13/11/21 10:31:39 INFO bsp.BSPJobClient:   org.apache.hama.bsp.BSPPeerImpl$PeerCounter

13/11/21 10:31:39 INFO bsp.BSPJobClient:     SUPERSTEP_SUM=45

13/11/21 10:31:39 INFO bsp.BSPJobClient:     TIME_IN_SYNC_MS=32

13/11/21 10:31:39 INFO bsp.BSPJobClient:     TOTAL_MESSAGES_SENT=135

13/11/21 10:31:39 INFO bsp.BSPJobClient:     TOTAL_MESSAGES_RECEIVED=135

13/11/21 10:31:39 INFO bsp.BSPJobClient:     TASK_OUTPUT_RECORDS=135

Tests run: 1, Failures: 0, Errors: 0, Skipped: 0, Time elapsed: 0.008 sec
Running org.apache.hama.bsp.message.TestSpillingQueue
Tests run: 2, Failures: 0, Errors: 0, Skipped: 0, Time elapsed: 0.008 sec
Running org.apache.hama.zookeeper.TestZKTools
Tests run: 1, Failures: 0, Errors: 0, Skipped: 0, Time elapsed: 0.011 sec
Running org.apache.hama.bsp.TestZooKeeper
13/11/21 10:31:42 ERROR quorum.QuorumPeerConfig: Invalid configuration, only one server specified
(ignoring)

13/11/21 10:31:42 INFO server.ZooKeeperServerMain: Starting server

13/11/21 10:31:42 INFO server.ZooKeeperServer: Server environment:zookeeper.version=3.4.5-1392090,
built on 09/30/2012 17:52 GMT

13/11/21 10:31:42 INFO server.ZooKeeperServer: Server environment:host.name=janus.apache.org

13/11/21 10:31:42 INFO server.ZooKeeperServer: Server environment:java.version=1.7.0_25

13/11/21 10:31:42 INFO server.ZooKeeperServer: Server environment:java.vendor=Oracle Corporation

13/11/21 10:31:42 INFO server.ZooKeeperServer: Server environment:java.home=/home/jenkins/tools/java/jdk1.7.0_25-32/jre

13/11/21 10:31:42 INFO server.ZooKeeperServer: Server environment:java.class.path=/tmp/surefirebooter2796615441117064255.jar

13/11/21 10:31:42 INFO server.ZooKeeperServer: Server environment:java.library.path=/usr/lib/jvm/java-6-openjdk-amd64/jre/lib/amd64/server:/usr/lib/jvm/java-6-openjdk-amd64/jre/lib/amd64:/usr/lib/jvm/java-6-openjdk-amd64/jre/../lib/amd64:/usr/java/packages/lib/i386:/lib:/usr/lib

13/11/21 10:31:42 INFO server.ZooKeeperServer: Server environment:java.io.tmpdir=/tmp

13/11/21 10:31:42 INFO server.ZooKeeperServer: Server environment:java.compiler=<NA>

13/11/21 10:31:42 INFO server.ZooKeeperServer: Server environment:os.name=Linux

13/11/21 10:31:42 INFO server.ZooKeeperServer: Server environment:os.arch=i386

13/11/21 10:31:42 INFO server.ZooKeeperServer: Server environment:os.version=3.2.0-51-generic

13/11/21 10:31:42 INFO server.ZooKeeperServer: Server environment:user.name=jenkins

13/11/21 10:31:42 INFO server.ZooKeeperServer: Server environment:user.home=/home/jenkins

13/11/21 10:31:42 INFO server.ZooKeeperServer: Server environment:user.dir=/tmp

13/11/21 10:31:42 INFO server.ZooKeeperServer: tickTime set to 3000

13/11/21 10:31:42 INFO server.ZooKeeperServer: minSessionTimeout set to -1

13/11/21 10:31:42 INFO server.ZooKeeperServer: maxSessionTimeout set to 1200000

13/11/21 10:31:42 INFO server.NIOServerCnxnFactory: binding to port 0.0.0.0/0.0.0.0:20000

13/11/21 10:31:42 INFO persistence.FileSnap: Reading snapshot /tmp/hama-testzookeeper/version-2/snapshot.ec

13/11/21 10:31:42 INFO persistence.FileTxnSnapLog: Snapshotting: 0xf1 to /tmp/hama-testzookeeper/version-2/snapshot.f1

13/11/21 10:31:52 INFO zookeeper.ZooKeeper: Client environment:zookeeper.version=3.4.5-1392090,
built on 09/30/2012 17:52 GMT

13/11/21 10:31:52 INFO zookeeper.ZooKeeper: Client environment:host.name=janus.apache.org

13/11/21 10:31:52 INFO zookeeper.ZooKeeper: Client environment:java.version=1.7.0_25

13/11/21 10:31:52 INFO zookeeper.ZooKeeper: Client environment:java.vendor=Oracle Corporation

13/11/21 10:31:52 INFO zookeeper.ZooKeeper: Client environment:java.home=/home/jenkins/tools/java/jdk1.7.0_25-32/jre

13/11/21 10:31:52 INFO zookeeper.ZooKeeper: Client environment:java.class.path=/tmp/surefirebooter2796615441117064255.jar

13/11/21 10:31:52 INFO zookeeper.ZooKeeper: Client environment:java.library.path=/usr/lib/jvm/java-6-openjdk-amd64/jre/lib/amd64/server:/usr/lib/jvm/java-6-openjdk-amd64/jre/lib/amd64:/usr/lib/jvm/java-6-openjdk-amd64/jre/../lib/amd64:/usr/java/packages/lib/i386:/lib:/usr/lib

13/11/21 10:31:52 INFO zookeeper.ZooKeeper: Client environment:java.io.tmpdir=/tmp

13/11/21 10:31:52 INFO zookeeper.ZooKeeper: Client environment:java.compiler=<NA>

13/11/21 10:31:52 INFO zookeeper.ZooKeeper: Client environment:os.name=Linux

13/11/21 10:31:52 INFO zookeeper.ZooKeeper: Client environment:os.arch=i386

13/11/21 10:31:52 INFO zookeeper.ZooKeeper: Client environment:os.version=3.2.0-51-generic

13/11/21 10:31:52 INFO zookeeper.ZooKeeper: Client environment:user.name=jenkins

13/11/21 10:31:52 INFO zookeeper.ZooKeeper: Client environment:user.home=/home/jenkins

13/11/21 10:31:52 INFO zookeeper.ZooKeeper: Client environment:user.dir=/tmp

13/11/21 10:31:52 INFO zookeeper.ZooKeeper: Initiating client connection, connectString=localhost:20000
sessionTimeout=1200000 watcher=org.apache.hama.bsp.sync.ZKSyncBSPMasterClient@1fc0cb0

13/11/21 10:31:52 INFO sync.ZKSyncBSPMasterClient: Initialized ZK false

13/11/21 10:31:52 INFO sync.ZKSyncClient: Initializing ZK Sync Client

13/11/21 10:31:52 INFO zookeeper.ClientCnxn: Opening socket connection to server localhost/127.0.0.1:20000.
Will not attempt to authenticate using SASL (unknown error)

13/11/21 10:31:52 INFO zookeeper.ClientCnxn: Socket connection established to localhost/127.0.0.1:20000,
initiating session

13/11/21 10:31:52 INFO server.NIOServerCnxnFactory: Accepted socket connection from /127.0.0.1:47513

13/11/21 10:31:52 INFO server.ZooKeeperServer: Client attempting to establish new session
at /127.0.0.1:47513

13/11/21 10:31:52 INFO persistence.FileTxnLog: Creating new log file: log.f2

13/11/21 10:31:52 INFO server.ZooKeeperServer: Established session 0x1427a371f300000 with
negotiated timeout 1200000 for client /127.0.0.1:47513

13/11/21 10:31:52 INFO zookeeper.ClientCnxn: Session establishment complete on server localhost/127.0.0.1:20000,
sessionid = 0x1427a371f300000, negotiated timeout = 1200000

13/11/21 10:31:52 INFO mortbay.log: Logging to org.slf4j.impl.Log4jLoggerAdapter(org.mortbay.log)
via org.mortbay.log.Slf4jLog

13/11/21 10:31:52 INFO mortbay.log: Created master and client sync clients

13/11/21 10:31:52 INFO mortbay.log: BSP root exists

13/11/21 10:31:52 INFO zookeeper.ZooKeeper: Initiating client connection, connectString=localhost:20000
sessionTimeout=1200000 watcher=org.apache.hama.bsp.sync.ZooKeeperSyncClientImpl@23abe6

13/11/21 10:31:52 INFO sync.ZKSyncClient: Initializing ZK Sync Client

13/11/21 10:31:52 INFO sync.ZooKeeperSyncClientImpl: Start connecting to Zookeeper! At /0.0.0.0:21815

13/11/21 10:31:52 INFO zookeeper.ClientCnxn: Opening socket connection to server localhost/0:0:0:0:0:0:0:1:20000.
Will not attempt to authenticate using SASL (unknown error)

13/11/21 10:31:52 INFO server.NIOServerCnxnFactory: Accepted socket connection from /0:0:0:0:0:0:0:1:60116

13/11/21 10:31:52 INFO zookeeper.ClientCnxn: Socket connection established to localhost/0:0:0:0:0:0:0:1:20000,
initiating session

13/11/21 10:31:52 INFO server.ZooKeeperServer: Client attempting to establish new session
at /0:0:0:0:0:0:0:1:60116

13/11/21 10:31:52 INFO server.ZooKeeperServer: Established session 0x1427a371f300001 with
negotiated timeout 1200000 for client /0:0:0:0:0:0:0:1:60116

13/11/21 10:31:52 INFO zookeeper.ClientCnxn: Session establishment complete on server localhost/0:0:0:0:0:0:0:1:20000,
sessionid = 0x1427a371f300001, negotiated timeout = 1200000

13/11/21 10:31:52 INFO sync.ZKSyncClient: Writing data /bsp/job_test1_0001/info/level2

13/11/21 10:31:52 INFO mortbay.log: Found child count = 2

13/11/21 10:31:52 INFO mortbay.log: Passed the child count test

13/11/21 10:31:52 INFO mortbay.log: Found child count = 2

13/11/21 10:31:52 INFO mortbay.log:  Peer name 2

13/11/21 10:31:52 INFO mortbay.log:  Peer name 1

13/11/21 10:31:52 INFO mortbay.log: Passed the child key set test

13/11/21 10:31:52 INFO mortbay.log: /bsp/job_test1_0001

13/11/21 10:31:52 INFO mortbay.log: Passed the key presence test

13/11/21 10:31:52 INFO sync.ZKSyncClient: Writing data /bsp/job_test1_0001/info/level3

13/11/21 10:31:52 INFO mortbay.log: Passed array writable test

13/11/21 10:31:52 INFO server.NIOServerCnxn: Closed socket connection for client /0:0:0:0:0:0:0:1:60116
which had sessionid 0x1427a371f300001

13/11/21 10:31:52 INFO zookeeper.ClientCnxn: Unable to read additional data from server sessionid
0x1427a371f300001, likely server has closed socket, closing socket connection and attempting
reconnect

13/11/21 10:31:52 INFO server.NIOServerCnxn: Closed socket connection for client /127.0.0.1:47513
which had sessionid 0x1427a371f300000

13/11/21 10:31:52 INFO zookeeper.ClientCnxn: Unable to read additional data from server sessionid
0x1427a371f300000, likely server has closed socket, closing socket connection and attempting
reconnect

13/11/21 10:31:52 INFO server.NIOServerCnxnFactory: NIOServerCnxn factory exited run method

13/11/21 10:31:52 INFO server.ZooKeeperServer: shutting down

13/11/21 10:31:52 INFO server.SessionTrackerImpl: Shutting down

13/11/21 10:31:52 INFO server.PrepRequestProcessor: Shutting down

13/11/21 10:31:52 INFO server.SyncRequestProcessor: Shutting down

13/11/21 10:31:52 INFO server.PrepRequestProcessor: PrepRequestProcessor exited loop!

13/11/21 10:31:52 INFO server.ZooKeeperServer: shutting down

13/11/21 10:31:52 INFO server.SessionTrackerImpl: Shutting down

13/11/21 10:31:52 INFO server.SyncRequestProcessor: SyncRequestProcessor exited!

13/11/21 10:31:52 INFO server.PrepRequestProcessor: Shutting down

13/11/21 10:31:52 INFO server.FinalRequestProcessor: shutdown of request processor complete

13/11/21 10:31:52 INFO server.SyncRequestProcessor: Shutting down

13/11/21 10:31:52 INFO server.FinalRequestProcessor: shutdown of request processor complete

Tests run: 1, Failures: 0, Errors: 0, Skipped: 0, Time elapsed: 0.014 sec

Results :

Failed tests: 

Tests run: 65, Failures: 1, Errors: 0, Skipped: 0

[INFO] ------------------------------------------------------------------------
[INFO] Reactor Summary:
[INFO] 
[INFO] Apache Hama parent POM ............................ SUCCESS [11.236s]
[INFO] pipes ............................................. SUCCESS [11.751s]
[INFO] commons ........................................... SUCCESS [6.457s]
[INFO] core .............................................. FAILURE [2:12.012s]
[INFO] graph ............................................. SKIPPED
[INFO] machine learning .................................. SKIPPED
[INFO] examples .......................................... SKIPPED
[INFO] hama-dist ......................................... SKIPPED
[INFO] ------------------------------------------------------------------------
[INFO] BUILD FAILURE
[INFO] ------------------------------------------------------------------------
[INFO] Total time: 2:42.751s
[INFO] Finished at: Thu Nov 21 10:31:52 UTC 2013
[INFO] Final Memory: 65M/990M
[INFO] ------------------------------------------------------------------------
[ERROR] Failed to execute goal org.apache.maven.plugins:maven-surefire-plugin:2.6:test (default-test)
on project hama-core: There are test failures.
[ERROR] 
[ERROR] Please refer to <https://builds.apache.org/job/Hama-Nightly-for-Hadoop-2.x/ws/trunk/core/target/surefire-reports>
for the individual test results.
[ERROR] -> [Help 1]
[ERROR] 
[ERROR] To see the full stack trace of the errors, re-run Maven with the -e switch.
[ERROR] Re-run Maven using the -X switch to enable full debug logging.
[ERROR] 
[ERROR] For more information about the errors and possible solutions, please read the following
articles:
[ERROR] [Help 1] http://cwiki.apache.org/confluence/display/MAVEN/MojoFailureException
[ERROR] 
[ERROR] After correcting the problems, you can resume the build with the command
[ERROR]   mvn <goals> -rf :hama-core
Build step 'Invoke top-level Maven targets' marked build as failure
Archiving artifacts
Recording test results

Mime
View raw message