hama-dev mailing list archives

Site index · List index
Message view « Date » · « Thread »
Top « Date » · « Thread »
From Apache Jenkins Server <jenk...@builds.apache.org>
Subject Build failed in Jenkins: Hama-Nightly-for-Hadoop-2.x #50
Date Tue, 01 Oct 2013 23:38:49 GMT
See <https://builds.apache.org/job/Hama-Nightly-for-Hadoop-2.x/50/changes>

Changes:

[edwardyoon] 

[edwardyoon] Just for test

[edwardyoon] Add debugging messages

------------------------------------------
[...truncated 14119 lines...]
1123/1479 KB   
1127/1479 KB   
1131/1479 KB   
1135/1479 KB   
1139/1479 KB   
1143/1479 KB   
1147/1479 KB   
1151/1479 KB   
1155/1479 KB   
1159/1479 KB   
1163/1479 KB   
1167/1479 KB   
1171/1479 KB   
1175/1479 KB   
1179/1479 KB   
1183/1479 KB   
1187/1479 KB   
1191/1479 KB   
1195/1479 KB   
1199/1479 KB   
1203/1479 KB   
1207/1479 KB   
1211/1479 KB   
1215/1479 KB   
1219/1479 KB   
1223/1479 KB   
1227/1479 KB   
1231/1479 KB   
1235/1479 KB   
1239/1479 KB   
1243/1479 KB   
1247/1479 KB   
1251/1479 KB   
1255/1479 KB   
1259/1479 KB   
1263/1479 KB   
1267/1479 KB   
1271/1479 KB   
1275/1479 KB   
1279/1479 KB   
1283/1479 KB   
1287/1479 KB   
1291/1479 KB   
1295/1479 KB   
1299/1479 KB   
1303/1479 KB   
1307/1479 KB   
1311/1479 KB   
1315/1479 KB   
1319/1479 KB   
1323/1479 KB   
1327/1479 KB   
1331/1479 KB   
1335/1479 KB   
1339/1479 KB   
1343/1479 KB   
1347/1479 KB   
1351/1479 KB   
1355/1479 KB   
1359/1479 KB   
1363/1479 KB   
1367/1479 KB   
1371/1479 KB   
1375/1479 KB   
1379/1479 KB   
1383/1479 KB   
1387/1479 KB   
1391/1479 KB   
1395/1479 KB   
1399/1479 KB   
1403/1479 KB   
1407/1479 KB   
1411/1479 KB   
1415/1479 KB   
1419/1479 KB   
1423/1479 KB   
1427/1479 KB   
1431/1479 KB   
1435/1479 KB   
1439/1479 KB   
1443/1479 KB   
1447/1479 KB   
1451/1479 KB   
1455/1479 KB   
1459/1479 KB   
1463/1479 KB   
1467/1479 KB   
1471/1479 KB   
1475/1479 KB   
1479/1479 KB   
1479/1479 KB   
               
Downloaded: http://repo.maven.apache.org/maven2/org/apache/ant/ant/1.8.1/ant-1.8.1.jar (1479
KB at 7622.6 KB/sec)
[INFO] Executing tasks

main:
    [mkdir] Created dir: /home/hudson/jenkins-slave/workspace/Hama-Nightly-for-Hadoop-2.x/trunk/c++/target/native
     [exec] -- The C compiler identification is GNU
     [exec] -- The CXX compiler identification is GNU
     [exec] -- Check for working C compiler: /usr/bin/gcc
     [exec] -- Check for working C compiler: /usr/bin/gcc -- works
     [exec] -- Detecting C compiler ABI info
     [exec] -- Detecting C compiler ABI info - done
     [exec] -- Check for working CXX compiler: /usr/bin/c++
     [exec] -- Check for working CXX compiler: /usr/bin/c++ -- works
     [exec] -- Detecting CXX compiler ABI info
     [exec] -- Detecting CXX compiler ABI info - done
     [exec] -- checking for module 'openssl'
     [exec] --   found openssl, version 1.0.1
     [exec] -- Found OpenSSL: /usr/lib/x86_64-linux-gnu/libssl.so;/usr/lib/x86_64-linux-gnu/libcrypto.so
(found version "1..1")
     [exec] >>>>> OpenSSL include dir: /usr/include
     [exec] >>>>> OpenSSL libraries: /usr/lib/x86_64-linux-gnu/libssl.so;/usr/lib/x86_64-linux-gnu/libcrypto.so
     [exec] JAVA_HOME=, JAVA_JVM_LIBRARY=/home/hudson/tools/java/latest1.7/jre/lib/i386/server/libjvm.so
     [exec] JAVA_INCLUDE_PATH=/home/hudson/tools/java/latest1.7/include, JAVA_INCLUDE_PATH2=/home/hudson/tools/java/latest1.7/include/linux
     [exec] Located all JNI components successfully.
     [exec] -- Configuring done
     [exec] -- Generating done
     [exec] -- Build files have been written to: /home/hudson/jenkins-slave/workspace/Hama-Nightly-for-Hadoop-2.x/trunk/c++/target/native
     [exec] /usr/bin/cmake -H/home/hudson/jenkins-slave/workspace/Hama-Nightly-for-Hadoop-2.x/trunk/c++/src
-B/home/hudson/jenkins-slave/workspace/Hama-Nightly-for-Hadoop-2.x/trunk/c++/target/native
--check-build-system CMakeFiles/Makefile.cmake 0
     [exec] /usr/bin/cmake -E cmake_progress_start /home/hudson/jenkins-slave/workspace/Hama-Nightly-for-Hadoop-2.x/trunk/c++/target/native/CMakeFiles
/home/hudson/jenkins-slave/workspace/Hama-Nightly-for-Hadoop-2.x/trunk/c++/target/native/CMakeFiles/progress.marks
     [exec] make -f CMakeFiles/Makefile2 all
     [exec] make[1]: Entering directory `/home/hudson/jenkins-slave/workspace/Hama-Nightly-for-Hadoop-2.x/trunk/c++/target/native'
     [exec] make -f CMakeFiles/DenseDoubleVector.dir/build.make CMakeFiles/DenseDoubleVector.dir/depend
     [exec] make[2]: Entering directory `/home/hudson/jenkins-slave/workspace/Hama-Nightly-for-Hadoop-2.x/trunk/c++/target/native'
     [exec] cd /home/hudson/jenkins-slave/workspace/Hama-Nightly-for-Hadoop-2.x/trunk/c++/target/native
&& /usr/bin/cmake -E cmake_depends "Unix Makefiles" /home/hudson/jenkins-slave/workspace/Hama-Nightly-for-Hadoop-2.x/trunk/c++/src
/home/hudson/jenkins-slave/workspace/Hama-Nightly-for-Hadoop-2.x/trunk/c++/src /home/hudson/jenkins-slave/workspace/Hama-Nightly-for-Hadoop-2.x/trunk/c++/target/native
/home/hudson/jenkins-slave/workspace/Hama-Nightly-for-Hadoop-2.x/trunk/c++/target/native /home/hudson/jenkins-slave/workspace/Hama-Nightly-for-Hadoop-2.x/trunk/c++/target/native/CMakeFiles/DenseDoubleVector.dir/DependInfo.cmake
--color=
     [exec] Dependee "/home/hudson/jenkins-slave/workspace/Hama-Nightly-for-Hadoop-2.x/trunk/c++/target/native/CMakeFiles/DenseDoubleVector.dir/DependInfo.cmake"
is newer than depender "/home/hudson/jenkins-slave/workspace/Hama-Nightly-for-Hadoop-2.x/trunk/c++/target/native/CMakeFiles/DenseDoubleVector.dir/depend.internal".
     [exec] Dependee "/home/hudson/jenkins-slave/workspace/Hama-Nightly-for-Hadoop-2.x/trunk/c++/target/native/CMakeFiles/CMakeDirectoryInformation.cmake"
is newer than depender "/home/hudson/jenkins-slave/workspace/Hama-Nightly-for-Hadoop-2.x/trunk/c++/target/native/CMakeFiles/DenseDoubleVector.dir/depend.internal".
     [exec] Scanning dependencies of target DenseDoubleVector
     [exec] make[2]: Leaving directory `/home/hudson/jenkins-slave/workspace/Hama-Nightly-for-Hadoop-2.x/trunk/c++/target/native'
     [exec] make -f CMakeFiles/DenseDoubleVector.dir/build.make CMakeFiles/DenseDoubleVector.dir/build
     [exec] make[2]: Entering directory `/home/hudson/jenkins-slave/workspace/Hama-Nightly-for-Hadoop-2.x/trunk/c++/target/native'
     [exec] /usr/bin/cmake -E cmake_progress_report /home/hudson/jenkins-slave/workspace/Hama-Nightly-for-Hadoop-2.x/trunk/c++/target/native/CMakeFiles
1
     [exec] [ 12%] Building CXX object CMakeFiles/DenseDoubleVector.dir/main/native/examples/impl/DenseDoubleVector.cc.o
     [exec] /usr/bin/c++    -g -Wall -O2 -D_REENTRANT -D_GNU_SOURCE -D_LARGEFILE_SOURCE -D_FILE_OFFSET_BITS=64
-m32 -I/home/hudson/jenkins-slave/workspace/Hama-Nightly-for-Hadoop-2.x/trunk/c++/src/main/native/utils/api
-I/home/hudson/jenkins-slave/workspace/Hama-Nightly-for-Hadoop-2.x/trunk/c++/src/main/native/pipes/api
-I/home/hudson/jenkins-slave/workspace/Hama-Nightly-for-Hadoop-2.x/trunk/c++/src    -o CMakeFiles/DenseDoubleVector.dir/main/native/examples/impl/DenseDoubleVector.cc.o
-c /home/hudson/jenkins-slave/workspace/Hama-Nightly-for-Hadoop-2.x/trunk/c++/src/main/native/examples/impl/DenseDoubleVector.cc
     [exec] /home/hudson/jenkins-slave/workspace/Hama-Nightly-for-Hadoop-2.x/trunk/c++/src/main/native/examples/impl/DenseDoubleVector.hh:
In constructor 'math::DenseDoubleVector::DenseDoubleVector(int)':
     [exec] /home/hudson/jenkins-slave/workspace/Hama-Nightly-for-Hadoop-2.x/trunk/c++/src/main/native/examples/impl/DenseDoubleVector.hh:28:9:
warning: 'math::DenseDoubleVector::size' will be initialized after [-Wreorder]
     [exec] /home/hudson/jenkins-slave/workspace/Hama-Nightly-for-Hadoop-2.x/trunk/c++/src/main/native/examples/impl/DenseDoubleVector.hh:27:13:
warning:   'double* math::DenseDoubleVector::vector' [-Wreorder]
     [exec] /home/hudson/jenkins-slave/workspace/Hama-Nightly-for-Hadoop-2.x/trunk/c++/src/main/native/examples/impl/DenseDoubleVector.cc:35:3:
warning:   when initialized here [-Wreorder]
     [exec] /home/hudson/jenkins-slave/workspace/Hama-Nightly-for-Hadoop-2.x/trunk/c++/src/main/native/examples/impl/DenseDoubleVector.hh:
In constructor 'math::DenseDoubleVector::DenseDoubleVector(int, double)':
     [exec] /home/hudson/jenkins-slave/workspace/Hama-Nightly-for-Hadoop-2.x/trunk/c++/src/main/native/examples/impl/DenseDoubleVector.hh:28:9:
warning: 'math::DenseDoubleVector::size' will be initialized after [-Wreorder]
     [exec] /home/hudson/jenkins-slave/workspace/Hama-Nightly-for-Hadoop-2.x/trunk/c++/src/main/native/examples/impl/DenseDoubleVector.hh:27:13:
warning:   'double* math::DenseDoubleVector::vector' [-Wreorder]
     [exec] /home/hudson/jenkins-slave/workspace/Hama-Nightly-for-Hadoop-2.x/trunk/c++/src/main/native/examples/impl/DenseDoubleVector.cc:38:3:
warning:   when initialized here [-Wreorder]
     [exec] Linking CXX static library libDenseDoubleVector.a
     [exec] /usr/bin/cmake -P CMakeFiles/DenseDoubleVector.dir/cmake_clean_target.cmake
     [exec] /usr/bin/cmake -E cmake_link_script CMakeFiles/DenseDoubleVector.dir/link.txt
--verbose=1
     [exec] /usr/bin/ar cr libDenseDoubleVector.a  CMakeFiles/DenseDoubleVector.dir/main/native/examples/impl/DenseDoubleVector.cc.o
     [exec] /usr/bin/ranlib libDenseDoubleVector.a
     [exec] make[2]: Leaving directory `/home/hudson/jenkins-slave/workspace/Hama-Nightly-for-Hadoop-2.x/trunk/c++/target/native'
     [exec] /usr/bin/cmake -E cmake_progress_report /home/hudson/jenkins-slave/workspace/Hama-Nightly-for-Hadoop-2.x/trunk/c++/target/native/CMakeFiles
 1
     [exec] [ 12%] Built target DenseDoubleVector
     [exec] make -f CMakeFiles/hadooputils.dir/build.make CMakeFiles/hadooputils.dir/depend
     [exec] make[2]: Entering directory `/home/hudson/jenkins-slave/workspace/Hama-Nightly-for-Hadoop-2.x/trunk/c++/target/native'
     [exec] cd /home/hudson/jenkins-slave/workspace/Hama-Nightly-for-Hadoop-2.x/trunk/c++/target/native
&& /usr/bin/cmake -E cmake_depends "Unix Makefiles" /home/hudson/jenkins-slave/workspace/Hama-Nightly-for-Hadoop-2.x/trunk/c++/src
/home/hudson/jenkins-slave/workspace/Hama-Nightly-for-Hadoop-2.x/trunk/c++/src /home/hudson/jenkins-slave/workspace/Hama-Nightly-for-Hadoop-2.x/trunk/c++/target/native
/home/hudson/jenkins-slave/workspace/Hama-Nightly-for-Hadoop-2.x/trunk/c++/target/native /home/hudson/jenkins-slave/workspace/Hama-Nightly-for-Hadoop-2.x/trunk/c++/target/native/CMakeFiles/hadooputils.dir/DependInfo.cmake
--color=
     [exec] Dependee "/home/hudson/jenkins-slave/workspace/Hama-Nightly-for-Hadoop-2.x/trunk/c++/target/native/CMakeFiles/hadooputils.dir/DependInfo.cmake"
is newer than depender "/home/hudson/jenkins-slave/workspace/Hama-Nightly-for-Hadoop-2.x/trunk/c++/target/native/CMakeFiles/hadooputils.dir/depend.internal".
     [exec] Dependee "/home/hudson/jenkins-slave/workspace/Hama-Nightly-for-Hadoop-2.x/trunk/c++/target/native/CMakeFiles/CMakeDirectoryInformation.cmake"
is newer than depender "/home/hudson/jenkins-slave/workspace/Hama-Nightly-for-Hadoop-2.x/trunk/c++/target/native/CMakeFiles/hadooputils.dir/depend.internal".
     [exec] Scanning dependencies of target hadooputils
     [exec] make[2]: Leaving directory `/home/hudson/jenkins-slave/workspace/Hama-Nightly-for-Hadoop-2.x/trunk/c++/target/native'
     [exec] make -f CMakeFiles/hadooputils.dir/build.make CMakeFiles/hadooputils.dir/build
     [exec] make[2]: Entering directory `/home/hudson/jenkins-slave/workspace/Hama-Nightly-for-Hadoop-2.x/trunk/c++/target/native'
     [exec] /usr/bin/cmake -E cmake_progress_report /home/hudson/jenkins-slave/workspace/Hama-Nightly-for-Hadoop-2.x/trunk/c++/target/native/CMakeFiles
2
     [exec] [ 25%] Building CXX object CMakeFiles/hadooputils.dir/main/native/utils/impl/StringUtils.cc.o
     [exec] /usr/bin/c++    -g -Wall -O2 -D_REENTRANT -D_GNU_SOURCE -D_LARGEFILE_SOURCE -D_FILE_OFFSET_BITS=64
-m32 -I/home/hudson/jenkins-slave/workspace/Hama-Nightly-for-Hadoop-2.x/trunk/c++/src/main/native/utils/api
-I/home/hudson/jenkins-slave/workspace/Hama-Nightly-for-Hadoop-2.x/trunk/c++/src/main/native/pipes/api
-I/home/hudson/jenkins-slave/workspace/Hama-Nightly-for-Hadoop-2.x/trunk/c++/src    -o CMakeFiles/hadooputils.dir/main/native/utils/impl/StringUtils.cc.o
-c /home/hudson/jenkins-slave/workspace/Hama-Nightly-for-Hadoop-2.x/trunk/c++/src/main/native/utils/impl/StringUtils.cc
     [exec] /usr/bin/cmake -E cmake_progress_report /home/hudson/jenkins-slave/workspace/Hama-Nightly-for-Hadoop-2.x/trunk/c++/target/native/CMakeFiles
3
     [exec] [ 37%] Building CXX object CMakeFiles/hadooputils.dir/main/native/utils/impl/Splitter.cc.o
     [exec] /usr/bin/c++    -g -Wall -O2 -D_REENTRANT -D_GNU_SOURCE -D_LARGEFILE_SOURCE -D_FILE_OFFSET_BITS=64
-m32 -I/home/hudson/jenkins-slave/workspace/Hama-Nightly-for-Hadoop-2.x/trunk/c++/src/main/native/utils/api
-I/home/hudson/jenkins-slave/workspace/Hama-Nightly-for-Hadoop-2.x/trunk/c++/src/main/native/pipes/api
-I/home/hudson/jenkins-slave/workspace/Hama-Nightly-for-Hadoop-2.x/trunk/c++/src    -o CMakeFiles/hadooputils.dir/main/native/utils/impl/Splitter.cc.o
-c /home/hudson/jenkins-slave/workspace/Hama-Nightly-for-Hadoop-2.x/trunk/c++/src/main/native/utils/impl/Splitter.cc
     [exec] /usr/bin/cmake -E cmake_progress_report /home/hudson/jenkins-slave/workspace/Hama-Nightly-for-Hadoop-2.x/trunk/c++/target/native/CMakeFiles
4
     [exec] [ 50%] Building CXX object CMakeFiles/hadooputils.dir/main/native/utils/impl/SerialUtils.cc.o
     [exec] /usr/bin/c++    -g -Wall -O2 -D_REENTRANT -D_GNU_SOURCE -D_LARGEFILE_SOURCE -D_FILE_OFFSET_BITS=64
-m32 -I/home/hudson/jenkins-slave/workspace/Hama-Nightly-for-Hadoop-2.x/trunk/c++/src/main/native/utils/api
-I/home/hudson/jenkins-slave/workspace/Hama-Nightly-for-Hadoop-2.x/trunk/c++/src/main/native/pipes/api
-I/home/hudson/jenkins-slave/workspace/Hama-Nightly-for-Hadoop-2.x/trunk/c++/src    -o CMakeFiles/hadooputils.dir/main/native/utils/impl/SerialUtils.cc.o
-c /home/hudson/jenkins-slave/workspace/Hama-Nightly-for-Hadoop-2.x/trunk/c++/src/main/native/utils/impl/SerialUtils.cc
     [exec] Linking CXX static library libhadooputils.a
     [exec] /usr/bin/cmake -P CMakeFiles/hadooputils.dir/cmake_clean_target.cmake
     [exec] /usr/bin/cmake -E cmake_link_script CMakeFiles/hadooputils.dir/link.txt --verbose=1
     [exec] /usr/bin/ar cr libhadooputils.a  CMakeFiles/hadooputils.dir/main/native/utils/impl/StringUtils.cc.o
CMakeFiles/hadooputils.dir/main/native/utils/impl/Splitter.cc.o CMakeFiles/hadooputils.dir/main/native/utils/impl/SerialUtils.cc.o
     [exec] /usr/bin/ranlib libhadooputils.a
     [exec] make[2]: Leaving directory `/home/hudson/jenkins-slave/workspace/Hama-Nightly-for-Hadoop-2.x/trunk/c++/target/native'
     [exec] /usr/bin/cmake -E cmake_progress_report /home/hudson/jenkins-slave/workspace/Hama-Nightly-for-Hadoop-2.x/trunk/c++/target/native/CMakeFiles
 2 3 4
     [exec] [ 50%] Built target hadooputils
     [exec] make -f CMakeFiles/hamapipes.dir/build.make CMakeFiles/hamapipes.dir/depend
     [exec] make[2]: Entering directory `/home/hudson/jenkins-slave/workspace/Hama-Nightly-for-Hadoop-2.x/trunk/c++/target/native'
     [exec] cd /home/hudson/jenkins-slave/workspace/Hama-Nightly-for-Hadoop-2.x/trunk/c++/target/native
&& /usr/bin/cmake -E cmake_depends "Unix Makefiles" /home/hudson/jenkins-slave/workspace/Hama-Nightly-for-Hadoop-2.x/trunk/c++/src
/home/hudson/jenkins-slave/workspace/Hama-Nightly-for-Hadoop-2.x/trunk/c++/src /home/hudson/jenkins-slave/workspace/Hama-Nightly-for-Hadoop-2.x/trunk/c++/target/native
/home/hudson/jenkins-slave/workspace/Hama-Nightly-for-Hadoop-2.x/trunk/c++/target/native /home/hudson/jenkins-slave/workspace/Hama-Nightly-for-Hadoop-2.x/trunk/c++/target/native/CMakeFiles/hamapipes.dir/DependInfo.cmake
--color=
     [exec] Dependee "/home/hudson/jenkins-slave/workspace/Hama-Nightly-for-Hadoop-2.x/trunk/c++/target/native/CMakeFiles/hamapipes.dir/DependInfo.cmake"
is newer than depender "/home/hudson/jenkins-slave/workspace/Hama-Nightly-for-Hadoop-2.x/trunk/c++/target/native/CMakeFiles/hamapipes.dir/depend.internal".
     [exec] Dependee "/home/hudson/jenkins-slave/workspace/Hama-Nightly-for-Hadoop-2.x/trunk/c++/target/native/CMakeFiles/CMakeDirectoryInformation.cmake"
is newer than depender "/home/hudson/jenkins-slave/workspace/Hama-Nightly-for-Hadoop-2.x/trunk/c++/target/native/CMakeFiles/hamapipes.dir/depend.internal".
     [exec] Scanning dependencies of target hamapipes
     [exec] make[2]: Leaving directory `/home/hudson/jenkins-slave/workspace/Hama-Nightly-for-Hadoop-2.x/trunk/c++/target/native'
     [exec] make -f CMakeFiles/hamapipes.dir/build.make CMakeFiles/hamapipes.dir/build
     [exec] make[2]: Entering directory `/home/hudson/jenkins-slave/workspace/Hama-Nightly-for-Hadoop-2.x/trunk/c++/target/native'
     [exec] /usr/bin/cmake -E cmake_progress_report /home/hudson/jenkins-slave/workspace/Hama-Nightly-for-Hadoop-2.x/trunk/c++/target/native/CMakeFiles
5
     [exec] [ 62%] Building CXX object CMakeFiles/hamapipes.dir/main/native/pipes/impl/HamaPipes.cc.o
     [exec] /usr/bin/c++    -g -Wall -O2 -D_REENTRANT -D_GNU_SOURCE -D_LARGEFILE_SOURCE -D_FILE_OFFSET_BITS=64
-m32 -I/home/hudson/jenkins-slave/workspace/Hama-Nightly-for-Hadoop-2.x/trunk/c++/src/main/native/utils/api
-I/home/hudson/jenkins-slave/workspace/Hama-Nightly-for-Hadoop-2.x/trunk/c++/src/main/native/pipes/api
-I/home/hudson/jenkins-slave/workspace/Hama-Nightly-for-Hadoop-2.x/trunk/c++/src    -o CMakeFiles/hamapipes.dir/main/native/pipes/impl/HamaPipes.cc.o
-c /home/hudson/jenkins-slave/workspace/Hama-Nightly-for-Hadoop-2.x/trunk/c++/src/main/native/pipes/impl/HamaPipes.cc
     [exec] Linking CXX static library libhamapipes.a
     [exec] /usr/bin/cmake -P CMakeFiles/hamapipes.dir/cmake_clean_target.cmake
     [exec] /usr/bin/cmake -E cmake_link_script CMakeFiles/hamapipes.dir/link.txt --verbose=1
     [exec] /usr/bin/ar cr libhamapipes.a  CMakeFiles/hamapipes.dir/main/native/pipes/impl/HamaPipes.cc.o
     [exec] /usr/bin/ranlib libhamapipes.a
     [exec] make[2]: Leaving directory `/home/hudson/jenkins-slave/workspace/Hama-Nightly-for-Hadoop-2.x/trunk/c++/target/native'
     [exec] /usr/bin/cmake -E cmake_progress_report /home/hudson/jenkins-slave/workspace/Hama-Nightly-for-Hadoop-2.x/trunk/c++/target/native/CMakeFiles
 5
     [exec] [ 62%] Built target hamapipes
     [exec] make -f CMakeFiles/matrixmultiplication.dir/build.make CMakeFiles/matrixmultiplication.dir/depend
     [exec] make[2]: Entering directory `/home/hudson/jenkins-slave/workspace/Hama-Nightly-for-Hadoop-2.x/trunk/c++/target/native'
     [exec] cd /home/hudson/jenkins-slave/workspace/Hama-Nightly-for-Hadoop-2.x/trunk/c++/target/native
&& /usr/bin/cmake -E cmake_depends "Unix Makefiles" /home/hudson/jenkins-slave/workspace/Hama-Nightly-for-Hadoop-2.x/trunk/c++/src
/home/hudson/jenkins-slave/workspace/Hama-Nightly-for-Hadoop-2.x/trunk/c++/src /home/hudson/jenkins-slave/workspace/Hama-Nightly-for-Hadoop-2.x/trunk/c++/target/native
/home/hudson/jenkins-slave/workspace/Hama-Nightly-for-Hadoop-2.x/trunk/c++/target/native /home/hudson/jenkins-slave/workspace/Hama-Nightly-for-Hadoop-2.x/trunk/c++/target/native/CMakeFiles/matrixmultiplication.dir/DependInfo.cmake
--color=
     [exec] Dependee "/home/hudson/jenkins-slave/workspace/Hama-Nightly-for-Hadoop-2.x/trunk/c++/target/native/CMakeFiles/matrixmultiplication.dir/DependInfo.cmake"
is newer than depender "/home/hudson/jenkins-slave/workspace/Hama-Nightly-for-Hadoop-2.x/trunk/c++/target/native/CMakeFiles/matrixmultiplication.dir/depend.internal".
     [exec] Dependee "/home/hudson/jenkins-slave/workspace/Hama-Nightly-for-Hadoop-2.x/trunk/c++/target/native/CMakeFiles/CMakeDirectoryInformation.cmake"
is newer than depender "/home/hudson/jenkins-slave/workspace/Hama-Nightly-for-Hadoop-2.x/trunk/c++/target/native/CMakeFiles/matrixmultiplication.dir/depend.internal".
     [exec] Scanning dependencies of target matrixmultiplication
     [exec] make[2]: Leaving directory `/home/hudson/jenkins-slave/workspace/Hama-Nightly-for-Hadoop-2.x/trunk/c++/target/native'
     [exec] make -f CMakeFiles/matrixmultiplication.dir/build.make CMakeFiles/matrixmultiplication.dir/build
     [exec] make[2]: Entering directory `/home/hudson/jenkins-slave/workspace/Hama-Nightly-for-Hadoop-2.x/trunk/c++/target/native'
     [exec] /usr/bin/cmake -E cmake_progress_report /home/hudson/jenkins-slave/workspace/Hama-Nightly-for-Hadoop-2.x/trunk/c++/target/native/CMakeFiles
6
     [exec] [ 75%] Building CXX object CMakeFiles/matrixmultiplication.dir/main/native/examples/impl/matrixmultiplication.cc.o
     [exec] /usr/bin/c++    -g -Wall -O2 -D_REENTRANT -D_GNU_SOURCE -D_LARGEFILE_SOURCE -D_FILE_OFFSET_BITS=64
-m32 -I/home/hudson/jenkins-slave/workspace/Hama-Nightly-for-Hadoop-2.x/trunk/c++/src/main/native/utils/api
-I/home/hudson/jenkins-slave/workspace/Hama-Nightly-for-Hadoop-2.x/trunk/c++/src/main/native/pipes/api
-I/home/hudson/jenkins-slave/workspace/Hama-Nightly-for-Hadoop-2.x/trunk/c++/src    -o CMakeFiles/matrixmultiplication.dir/main/native/examples/impl/matrixmultiplication.cc.o
-c /home/hudson/jenkins-slave/workspace/Hama-Nightly-for-Hadoop-2.x/trunk/c++/src/main/native/examples/impl/matrixmultiplication.cc
     [exec] Linking CXX executable examples/matrixmultiplication
     [exec] /usr/bin/cmake -E cmake_link_script CMakeFiles/matrixmultiplication.dir/link.txt
--verbose=1
     [exec] /usr/bin/c++    -g -Wall -O2 -D_REENTRANT -D_GNU_SOURCE -D_LARGEFILE_SOURCE -D_FILE_OFFSET_BITS=64
-m32    CMakeFiles/matrixmultiplication.dir/main/native/examples/impl/matrixmultiplication.cc.o
 -o examples/matrixmultiplication -rdynamic libDenseDoubleVector.a libhamapipes.a libhadooputils.a
-lssl -lcrypto -lpthread 
     [exec] /usr/bin/ld: cannot find -lssl
     [exec] /usr/bin/ld: cannot find -lcrypto
     [exec] collect2: ld returned 1 exit status
     [exec] make[2]: *** [examples/matrixmultiplication] Error 1
     [exec] make[1]: *** [CMakeFiles/matrixmultiplication.dir/all] Error 2
     [exec] make: *** [all] Error 2
     [exec] make[2]: Leaving directory `/home/hudson/jenkins-slave/workspace/Hama-Nightly-for-Hadoop-2.x/trunk/c++/target/native'
     [exec] make[1]: Leaving directory `/home/hudson/jenkins-slave/workspace/Hama-Nightly-for-Hadoop-2.x/trunk/c++/target/native'
[INFO] ------------------------------------------------------------------------
[INFO] Reactor Summary:
[INFO] 
[INFO] Apache Hama parent POM ............................ SUCCESS [14.145s]
[INFO] pipes ............................................. FAILURE [12.234s]
[INFO] core .............................................. SKIPPED
[INFO] graph ............................................. SKIPPED
[INFO] machine learning .................................. SKIPPED
[INFO] examples .......................................... SKIPPED
[INFO] hama-dist ......................................... SKIPPED
[INFO] ------------------------------------------------------------------------
[INFO] BUILD FAILURE
[INFO] ------------------------------------------------------------------------
[INFO] Total time: 27.964s
[INFO] Finished at: Tue Oct 01 23:38:35 UTC 2013
[INFO] Final Memory: 21M/344M
[INFO] ------------------------------------------------------------------------
[ERROR] Failed to execute goal org.apache.maven.plugins:maven-antrun-plugin:1.6:run (make)
on project hama-pipes: An Ant BuildException has occured: exec returned: 2 -> [Help 1]
[ERROR] 
[ERROR] To see the full stack trace of the errors, re-run Maven with the -e switch.
[ERROR] Re-run Maven using the -X switch to enable full debug logging.
[ERROR] 
[ERROR] For more information about the errors and possible solutions, please read the following
articles:
[ERROR] [Help 1] http://cwiki.apache.org/confluence/display/MAVEN/MojoExecutionException
[ERROR] 
[ERROR] After correcting the problems, you can resume the build with the command
[ERROR]   mvn <goals> -rf :hama-pipes
Build step 'Invoke top-level Maven targets' marked build as failure
Archiving artifacts
Recording test results

Mime
View raw message