hama-dev mailing list archives

Site index · List index
Message view « Date » · « Thread »
Top « Date » · « Thread »
From Apache Jenkins Server <jenk...@builds.apache.org>
Subject Build failed in Jenkins: Hama-Nightly-for-Hadoop-2.x #77
Date Sun, 27 Oct 2013 23:42:08 GMT
See <https://builds.apache.org/job/Hama-Nightly-for-Hadoop-2.x/77/>

------------------------------------------
[...truncated 17730 lines...]
517/519 KB   
519/519 KB   
             
Downloaded: http://repo.maven.apache.org/maven2/org/apache/maven/surefire/surefire-api/2.6/surefire-api-2.6.jar
(519 KB at 22539.1 KB/sec)
Downloading: http://repo.maven.apache.org/maven2/org/apache/maven/surefire/surefire-junit47/2.6/surefire-junit47-2.6.pom
3/3 KB       
         
Downloaded: http://repo.maven.apache.org/maven2/org/apache/maven/surefire/surefire-junit47/2.6/surefire-junit47-2.6.pom
(3 KB at 32.3 KB/sec)
Downloading: http://repo.maven.apache.org/maven2/org/apache/maven/surefire/surefire-providers/2.6/surefire-providers-2.6.pom
2/2 KB   
         
Downloaded: http://repo.maven.apache.org/maven2/org/apache/maven/surefire/surefire-providers/2.6/surefire-providers-2.6.pom
(2 KB at 214.1 KB/sec)
Downloading: http://repo.maven.apache.org/maven2/org/apache/maven/surefire/surefire-junit47/2.6/surefire-junit47-2.6.jar
4/27 KB   
7/27 KB   
11/27 KB   
15/27 KB   
19/27 KB   
23/27 KB   
27/27 KB   
27/27 KB   
           
Downloaded: http://repo.maven.apache.org/maven2/org/apache/maven/surefire/surefire-junit47/2.6/surefire-junit47-2.6.jar
(27 KB at 171.6 KB/sec)
[INFO] Concurrency config is {threadCount=10, parallel=methods, configurableParallelComputerPresent=false}
[INFO] Surefire report directory: /home/hudson/jenkins-slave/workspace/Hama-Nightly-for-Hadoop-2.x/trunk/core/target/surefire-reports

-------------------------------------------------------
 T E S T S
-------------------------------------------------------
Running org.apache.hama.util.TestZKUtil
log4j:WARN No appenders could be found for logger (org.apache.zookeeper.ZooKeeper).
log4j:WARN Please initialize the log4j system properly.
log4j:WARN See http://logging.apache.org/log4j/1.2/faq.html#noconfig for more info.
Tests run: 1, Failures: 0, Errors: 0, Skipped: 0, Time elapsed: 0.01 sec
Running org.apache.hama.bsp.message.TestDiskQueue
log4j:WARN No appenders could be found for logger (org.apache.hadoop.metrics2.lib.MutableMetricsFactory).
log4j:WARN Please initialize the log4j system properly.
log4j:WARN See http://logging.apache.org/log4j/1.2/faq.html#noconfig for more info.
Tests run: 2, Failures: 0, Errors: 0, Skipped: 0, Time elapsed: 0.008 sec
Running org.apache.hama.bsp.TestBSPMasterGroomServer
log4j:WARN No appenders could be found for logger (org.apache.hama.bsp.GroomServer).

log4j:WARN Please initialize the log4j system properly.
log4j:WARN See http://logging.apache.org/log4j/1.2/faq.html#noconfig for more info.

log4j:WARN No appenders could be found for logger (org.apache.hama.bsp.GroomServer).

log4j:WARN Please initialize the log4j system properly.
log4j:WARN See http://logging.apache.org/log4j/1.2/faq.html#noconfig for more info.

java.io.IOException: failed to remove existing native library file: /tmp/snappy-1.0.5-libsnappyjava.so
	at org.xerial.snappy.SnappyLoader.extractLibraryFile(SnappyLoader.java:386)
	at org.xerial.snappy.SnappyLoader.findNativeLibrary(SnappyLoader.java:468)
	at org.xerial.snappy.SnappyLoader.loadNativeLibrary(SnappyLoader.java:318)
	at org.xerial.snappy.SnappyLoader.load(SnappyLoader.java:229)
	at org.xerial.snappy.Snappy.<clinit>(Snappy.java:48)
	at org.xerial.snappy.SnappyOutputStream.<init>(SnappyOutputStream.java:79)
	at org.xerial.snappy.SnappyOutputStream.<init>(SnappyOutputStream.java:66)
	at org.apache.hama.bsp.message.compress.SnappyCompressor.compressBundle(SnappyCompressor.java:43)
	at org.apache.hama.bsp.message.HadoopMessageManagerImpl.transfer(HadoopMessageManagerImpl.java:114)
	at org.apache.hama.bsp.BSPPeerImpl.sync(BSPPeerImpl.java:388)
	at org.apache.hama.examples.ClassSerializePrinting.bsp(ClassSerializePrinting.java:55)
	at org.apache.hama.bsp.BSPTask.runBSP(BSPTask.java:177)
	at org.apache.hama.bsp.BSPTask.run(BSPTask.java:146)
	at org.apache.hama.bsp.GroomServer$BSPPeerChild.main(GroomServer.java:1246)
java.lang.reflect.InvocationTargetException

	at sun.reflect.NativeMethodAccessorImpl.invoke0(Native Method)
	at sun.reflect.NativeMethodAccessorImpl.invoke(NativeMethodAccessorImpl.java:57)
	at sun.reflect.DelegatingMethodAccessorImpl.invoke(DelegatingMethodAccessorImpl.java:43)
	at java.lang.reflect.Method.invoke(Method.java:606)
	at org.xerial.snappy.SnappyLoader.loadNativeLibrary(SnappyLoader.java:327)
	at org.xerial.snappy.SnappyLoader.load(SnappyLoader.java:229)
	at org.xerial.snappy.Snappy.<clinit>(Snappy.java:48)
	at org.xerial.snappy.SnappyOutputStream.<init>(SnappyOutputStream.java:79)
	at org.xerial.snappy.SnappyOutputStream.<init>(SnappyOutputStream.java:66)
	at org.apache.hama.bsp.message.compress.SnappyCompressor.compressBundle(SnappyCompressor.java:43)
	at org.apache.hama.bsp.message.HadoopMessageManagerImpl.transfer(HadoopMessageManagerImpl.java:114)
	at org.apache.hama.bsp.BSPPeerImpl.sync(BSPPeerImpl.java:388)
	at org.apache.hama.examples.ClassSerializePrinting.bsp(ClassSerializePrinting.java:55)
	at org.apache.hama.bsp.BSPTask.runBSP(BSPTask.java:177)
	at org.apache.hama.bsp.BSPTask.run(BSPTask.java:146)
	at org.apache.hama.bsp.GroomServer$BSPPeerChild.main(GroomServer.java:1246)
Caused by: java.lang.UnsatisfiedLinkError: no snappyjava in java.library.path
	at java.lang.ClassLoader.loadLibrary(ClassLoader.java:1878)
	at java.lang.Runtime.loadLibrary0(Runtime.java:849)
	at java.lang.System.loadLibrary(System.java:1087)
	at org.xerial.snappy.SnappyNativeLoader.loadLibrary(SnappyNativeLoader.java:52)
	... 16 more
Tests run: 1, Failures: 1, Errors: 0, Skipped: 0, Time elapsed: 0.011 sec <<< FAILURE!
log4j:WARN No appenders could be found for logger (org.apache.hadoop.util.Shell).
log4j:WARN Please initialize the log4j system properly.
log4j:WARN See http://logging.apache.org/log4j/1.2/faq.html#noconfig for more info.
Running org.apache.hama.bsp.message.compress.TestBSPMessageCompressor
Tests run: 1, Failures: 0, Errors: 0, Skipped: 0, Time elapsed: 0.009 sec
Running org.apache.hama.bsp.TestBSPMessageBundle
Tests run: 3, Failures: 0, Errors: 0, Skipped: 0, Time elapsed: 0.011 sec
Running org.apache.hama.util.TestNumeric
Tests run: 1, Failures: 0, Errors: 0, Skipped: 0, Time elapsed: 0.01 sec
Running org.apache.hama.bsp.TestClusterStatus
Tests run: 1, Failures: 0, Errors: 0, Skipped: 0, Time elapsed: 0.009 sec
Running org.apache.hama.monitor.TestFederator
log4j:WARN No appenders could be found for logger (org.apache.hama.monitor.TestFederator).
log4j:WARN Please initialize the log4j system properly.
log4j:WARN See http://logging.apache.org/log4j/1.2/faq.html#noconfig for more info.
Tests run: 1, Failures: 0, Errors: 0, Skipped: 0, Time elapsed: 0.01 sec
Running org.apache.hama.ipc.TestIPC
log4j:WARN No appenders could be found for logger (org.apache.hadoop.metrics2.lib.MutableMetricsFactory).
log4j:WARN Please initialize the log4j system properly.
log4j:WARN See http://logging.apache.org/log4j/1.2/faq.html#noconfig for more info.
Tests run: 3, Failures: 0, Errors: 0, Skipped: 0, Time elapsed: 0.01 sec
Running org.apache.hama.ipc.TestRPC
log4j:WARN No appenders could be found for logger (org.apache.hadoop.metrics2.lib.MutableMetricsFactory).
log4j:WARN Please initialize the log4j system properly.
log4j:WARN See http://logging.apache.org/log4j/1.2/faq.html#noconfig for more info.
Tests run: 1, Failures: 0, Errors: 0, Skipped: 0, Time elapsed: 0.008 sec
Running org.apache.hama.bsp.TestFileInputFormat
log4j:WARN No appenders could be found for logger (org.apache.hama.bsp.BSPJobClient).
log4j:WARN Please initialize the log4j system properly.
log4j:WARN See http://logging.apache.org/log4j/1.2/faq.html#noconfig for more info.
hdfs://hadoop.uta.edu/user/hadoop/employee.txt,hdfs://hadoop.uta.edu/user/hadoop/department.txt
hdfs://hadoop.uta.edu/user/hadoop/employee.txt
hdfs://hadoop.uta.edu/user/hadoop/department.txt
Tests run: 2, Failures: 0, Errors: 0, Skipped: 0, Time elapsed: 0.009 sec
Running org.apache.hama.util.TestRandomVariable
Tests run: 3, Failures: 0, Errors: 0, Skipped: 0, Time elapsed: 0.01 sec
Running org.apache.hama.bsp.TestKeyValueTextInputFormat
log4j:WARN No appenders could be found for logger (org.apache.hadoop.metrics2.lib.MutableMetricsFactory).
log4j:WARN Please initialize the log4j system properly.
log4j:WARN See http://logging.apache.org/log4j/1.2/faq.html#noconfig for more info.
Tests run: 1, Failures: 0, Errors: 0, Skipped: 0, Time elapsed: 0.007 sec
Running org.apache.hama.util.TestBytes
AAA
CCC
EEE
AAA
BBB
CCC
DDD
http://A
http://]
http://z
Tests run: 8, Failures: 0, Errors: 0, Skipped: 0, Time elapsed: 0.012 sec
Running org.apache.hama.bsp.TestBSPTaskFaults
log4j:WARN No appenders could be found for logger (org.apache.hadoop.metrics2.lib.MutableMetricsFactory).
log4j:WARN Please initialize the log4j system properly.
log4j:WARN See http://logging.apache.org/log4j/1.2/faq.html#noconfig for more info.
Tests run: 5, Failures: 0, Errors: 0, Skipped: 0, Time elapsed: 0.01 sec
Running org.apache.hama.bsp.message.TestMessageBundle
Tests run: 3, Failures: 0, Errors: 0, Skipped: 0, Time elapsed: 0.01 sec
Running org.apache.hama.bsp.sync.TestSyncServiceFactory
log4j:WARN No appenders could be found for logger (org.apache.hadoop.util.Shell).
log4j:WARN Please initialize the log4j system properly.
log4j:WARN See http://logging.apache.org/log4j/1.2/faq.html#noconfig for more info.
Tests run: 3, Failures: 0, Errors: 0, Skipped: 0, Time elapsed: 0.009 sec
Running org.apache.hama.bsp.message.compress.TestBSPCompressBundle
Tests run: 1, Failures: 0, Errors: 0, Skipped: 0, Time elapsed: 0.01 sec
Running org.apache.hama.bsp.TestPartitioning
Tests run: 1, Failures: 0, Errors: 0, Skipped: 0, Time elapsed: 0.007 sec
log4j:WARN No appenders could be found for logger (org.apache.hadoop.util.Shell).
log4j:WARN Please initialize the log4j system properly.
log4j:WARN See http://logging.apache.org/log4j/1.2/faq.html#noconfig for more info.
Running org.apache.hama.bsp.TestCheckpoint
log4j:WARN No appenders could be found for logger (org.apache.hadoop.metrics2.lib.MutableMetricsFactory).
log4j:WARN Please initialize the log4j system properly.
log4j:WARN See http://logging.apache.org/log4j/1.2/faq.html#noconfig for more info.
Tests run: 3, Failures: 0, Errors: 0, Skipped: 0, Time elapsed: 0.01 sec
Running org.apache.hama.bsp.message.TestHadoopMessageManager
log4j:WARN No appenders could be found for logger (org.apache.hadoop.metrics2.lib.MutableMetricsFactory).
log4j:WARN Please initialize the log4j system properly.
log4j:WARN See http://logging.apache.org/log4j/1.2/faq.html#noconfig for more info.
Peer is 0:0:0:0:0:0:0:0:33108
Peer is 0:0:0:0:0:0:0:0:43613
Tests run: 2, Failures: 0, Errors: 0, Skipped: 0, Time elapsed: 0.01 sec
Running org.apache.hama.bsp.TestMessages
Tests run: 1, Failures: 0, Errors: 0, Skipped: 0, Time elapsed: 0.01 sec
Running org.apache.hama.bsp.TestTaskAllocation
Tests run: 1, Failures: 0, Errors: 0, Skipped: 0, Time elapsed: 0.01 sec
Running org.apache.hama.monitor.fd.TestFD
Running org.apache.hama.bsp.message.TestMessageIO
log4j:WARN No appenders could be found for logger (org.apache.hama.bsp.message.io.SpillingDataOutputBuffer).
log4j:WARN Please initialize the log4j system properly.
log4j:WARN See http://logging.apache.org/log4j/1.2/faq.html#noconfig for more info.
Tests run: 10, Failures: 0, Errors: 0, Skipped: 0, Time elapsed: 0.012 sec
Running org.apache.hama.monitor.TestConfigurator
log4j:WARN No appenders could be found for logger (org.apache.hama.monitor.TestConfigurator).
log4j:WARN Please initialize the log4j system properly.
log4j:WARN See http://logging.apache.org/log4j/1.2/faq.html#noconfig for more info.
Tests run: 1, Failures: 0, Errors: 0, Skipped: 0, Time elapsed: 0.011 sec
Running org.apache.hama.bsp.message.TestSpillingQueue
log4j:WARN No appenders could be found for logger (org.apache.hama.bsp.message.io.SpillingDataOutputBuffer).
log4j:WARN Please initialize the log4j system properly.
log4j:WARN See http://logging.apache.org/log4j/1.2/faq.html#noconfig for more info.
Tests run: 2, Failures: 0, Errors: 0, Skipped: 0, Time elapsed: 0.009 sec
Running org.apache.hama.bsp.TestLocalRunner
log4j:WARN No appenders could be found for logger (org.apache.hama.bsp.BSPJobClient).
log4j:WARN Please initialize the log4j system properly.
log4j:WARN See http://logging.apache.org/log4j/1.2/faq.html#noconfig for more info.
Tests run: 1, Failures: 0, Errors: 0, Skipped: 0, Time elapsed: 0.008 sec
Running org.apache.hama.zookeeper.TestZKTools
log4j:WARN No appenders could be found for logger (org.apache.hadoop.util.Shell).
log4j:WARN Please initialize the log4j system properly.
log4j:WARN See http://logging.apache.org/log4j/1.2/faq.html#noconfig for more info.
Tests run: 1, Failures: 0, Errors: 0, Skipped: 0, Time elapsed: 0.02 sec
Running org.apache.hama.bsp.TestZooKeeper
log4j:WARN No appenders could be found for logger (org.apache.hadoop.util.Shell).
log4j:WARN Please initialize the log4j system properly.
log4j:WARN See http://logging.apache.org/log4j/1.2/faq.html#noconfig for more info.
Tests run: 1, Failures: 0, Errors: 0, Skipped: 0, Time elapsed: 0.008 sec

Results :

Failed tests: 

Tests run: 65, Failures: 1, Errors: 0, Skipped: 0

[INFO] ------------------------------------------------------------------------
[INFO] Reactor Summary:
[INFO] 
[INFO] Apache Hama parent POM ............................ SUCCESS [12.792s]
[INFO] pipes ............................................. SUCCESS [18.203s]
[INFO] core .............................................. FAILURE [2:26.079s]
[INFO] graph ............................................. SKIPPED
[INFO] machine learning .................................. SKIPPED
[INFO] examples .......................................... SKIPPED
[INFO] hama-dist ......................................... SKIPPED
[INFO] ------------------------------------------------------------------------
[INFO] BUILD FAILURE
[INFO] ------------------------------------------------------------------------
[INFO] Total time: 2:58.509s
[INFO] Finished at: Sun Oct 27 23:42:06 UTC 2013
[INFO] Final Memory: 38M/198M
[INFO] ------------------------------------------------------------------------
[ERROR] Failed to execute goal org.apache.maven.plugins:maven-surefire-plugin:2.6:test (default-test)
on project hama-core: There are test failures.
[ERROR] 
[ERROR] Please refer to /home/hudson/jenkins-slave/workspace/Hama-Nightly-for-Hadoop-2.x/trunk/core/target/surefire-reports
for the individual test results.
[ERROR] -> [Help 1]
[ERROR] 
[ERROR] To see the full stack trace of the errors, re-run Maven with the -e switch.
[ERROR] Re-run Maven using the -X switch to enable full debug logging.
[ERROR] 
[ERROR] For more information about the errors and possible solutions, please read the following
articles:
[ERROR] [Help 1] http://cwiki.apache.org/confluence/display/MAVEN/MojoFailureException
[ERROR] 
[ERROR] After correcting the problems, you can resume the build with the command
[ERROR]   mvn <goals> -rf :hama-core
Build step 'Invoke top-level Maven targets' marked build as failure
Archiving artifacts
Recording test results

Mime
View raw message