hama-dev mailing list archives

Site index · List index
Message view « Date » · « Thread »
Top « Date » · « Thread »
From Apache Jenkins Server <jenk...@builds.apache.org>
Subject Build failed in Jenkins: Hama-trunk #191
Date Wed, 02 Oct 2013 01:07:45 GMT
See <https://builds.apache.org/job/Hama-trunk/191/>

------------------------------------------
Started by user edwardyoon
Building remotely on ubuntu5 in workspace <https://builds.apache.org/job/Hama-trunk/ws/>
Reverting <https://builds.apache.org/job/Hama-trunk/ws/trunk> to depth infinity with
ignoreExternals: false
Updating http://svn.apache.org/repos/asf/hama/trunk at revision '2013-10-02T01:07:22.568 +0000'
At revision 1528293
no change for http://svn.apache.org/repos/asf/hama/trunk since the previous build
[Hama-trunk] $ /bin/bash -xe /tmp/hudson8471509792924994806.sh
+ echo /home/hudson/tools/java/latest1.6/bin:/usr/local/sbin:/usr/local/bin:/usr/sbin:/usr/bin:/sbin:/bin:/usr/bin/X11:/usr/games:/usr/ucb:/usr/sfw/bin:/usr/ccs/bin:/usr/ucb:/usr/sfw/bin:/usr/ccs/bin:/usr/ucb:/usr/sfw/bin:/usr/ccs/bin:/usr/ucb:/usr/sfw/bin:/usr/ccs/bin
/home/hudson/tools/java/latest1.6/bin:/usr/local/sbin:/usr/local/bin:/usr/sbin:/usr/bin:/sbin:/bin:/usr/bin/X11:/usr/games:/usr/ucb:/usr/sfw/bin:/usr/ccs/bin:/usr/ucb:/usr/sfw/bin:/usr/ccs/bin:/usr/ucb:/usr/sfw/bin:/usr/ccs/bin:/usr/ucb:/usr/sfw/bin:/usr/ccs/bin
+ whoami
jenkins
+ ulimit -a
core file size          (blocks, -c) 0
data seg size           (kbytes, -d) unlimited
scheduling priority             (-e) 0
file size               (blocks, -f) unlimited
pending signals                 (-i) 128228
max locked memory       (kbytes, -l) 64
max memory size         (kbytes, -m) unlimited
open files                      (-n) 40000
pipe size            (512 bytes, -p) 8
POSIX message queues     (bytes, -q) 819200
real-time priority              (-r) 0
stack size              (kbytes, -s) 8192
cpu time               (seconds, -t) unlimited
max user processes              (-u) 128228
virtual memory          (kbytes, -v) unlimited
file locks                      (-x) unlimited
[trunk] $ /home/hudson/tools/maven/apache-maven-3.0.4/bin/mvn -Dmaven.repo.local=<https://builds.apache.org/job/Hama-trunk/ws/.repository>
clean install -Phadoop1 -Dhadoop.version=1.2.0
[INFO] Scanning for projects...
[WARNING] 
[WARNING] Some problems were encountered while building the effective model for org.apache.hama:hama-core:jar:0.6.3-SNAPSHOT
[WARNING] 'build.plugins.plugin.version' for org.codehaus.mojo:build-helper-maven-plugin is
missing. @ line 204, column 15
[WARNING] 
[WARNING] It is highly recommended to fix these problems because they threaten the stability
of your build.
[WARNING] 
[WARNING] For this reason, future Maven versions might no longer support building such malformed
projects.
[WARNING] 
[INFO] ------------------------------------------------------------------------
[INFO] Reactor Build Order:
[INFO] 
[INFO] Apache Hama parent POM
[INFO] pipes
[INFO] core
[INFO] graph
[INFO] machine learning
[INFO] examples
[INFO] hama-dist
[INFO]                                                                         
[INFO] ------------------------------------------------------------------------
[INFO] Building Apache Hama parent POM 0.6.3-SNAPSHOT
[INFO] ------------------------------------------------------------------------
[INFO] 
[INFO] --- maven-clean-plugin:2.4.1:clean (default-clean) @ hama-parent ---
[INFO] Deleting <https://builds.apache.org/job/Hama-trunk/ws/trunk> (includes = [lib/**,
logs/**, docs/apidocs/**], excludes = [])
[INFO] 
[INFO] --- maven-remote-resources-plugin:1.1:process (default) @ hama-parent ---
[INFO] Setting property: classpath.resource.loader.class => 'org.codehaus.plexus.velocity.ContextClassLoaderResourceLoader'.
[INFO] Setting property: velocimacro.messages.on => 'false'.
[INFO] Setting property: resource.loader => 'classpath'.
[INFO] Setting property: resource.manager.logwhenfound => 'false'.
[INFO] 
[INFO] --- apache-rat-plugin:0.8:check (default) @ hama-parent ---
[INFO] Exclude: .idea/**
[INFO] Exclude: .git/**
[INFO] Exclude: .gitignore
[INFO] Exclude: **/.classpath/**
[INFO] Exclude: **/.project
[INFO] Exclude: **/*.iml
[INFO] Exclude: **/.settings/**
[INFO] Exclude: **/*.asc
[INFO] Exclude: **/dependency-reduced-pom.xml
[INFO] Exclude: **/logs/**
[INFO] Exclude: **/docs/**
[INFO] Exclude: CHANGES.txt
[INFO] Exclude: conf/groomservers
[INFO] Exclude: src/site/resources/files/hama-eclipse-formatter.xml
[INFO] Exclude: **/src/test/resources/*.properties
[INFO] Exclude: **dependency-reduced-pom.xml
[INFO] Exclude: **/src/test/resources/*.txt
[INFO] Exclude: **/target/**
[INFO] 
[INFO] --- maven-javadoc-plugin:2.8.1:jar (default) @ hama-parent ---
[INFO] Not executing Javadoc as the project is not a Java classpath-capable package
[INFO] 
[INFO] --- maven-install-plugin:2.3:install (default-install) @ hama-parent ---
[INFO] Installing <https://builds.apache.org/job/Hama-trunk/ws/trunk/pom.xml> to <https://builds.apache.org/job/Hama-trunk/ws/.repository/org/apache/hama/hama-parent/0.6.3-SNAPSHOT/hama-parent-0.6.3-SNAPSHOT.pom>
[INFO]                                                                         
[INFO] ------------------------------------------------------------------------
[INFO] Building pipes 0.6.3-SNAPSHOT
[INFO] ------------------------------------------------------------------------
[INFO] 
[INFO] --- maven-clean-plugin:2.4.1:clean (default-clean) @ hama-pipes ---
[INFO] Deleting <https://builds.apache.org/job/Hama-trunk/ws/trunk/c++> (includes =
[lib/**, logs/**, docs/apidocs/**], excludes = [])
[INFO] 
[INFO] --- maven-remote-resources-plugin:1.1:process (default) @ hama-pipes ---
[INFO] 
[INFO] --- maven-antrun-plugin:1.6:run (make) @ hama-pipes ---
[INFO] Executing tasks

main:
    [mkdir] Created dir: <https://builds.apache.org/job/Hama-trunk/ws/trunk/c++/target/native>
     [exec] -- Configuring done
     [exec] -- Generating done
     [exec] -- Build files have been written to: <https://builds.apache.org/job/Hama-trunk/ws/trunk/c++/src>
     [exec] >>>>> OpenSSL include dir: /usr/include
     [exec] >>>>> OpenSSL libraries: /usr/lib/x86_64-linux-gnu/libssl.so;/usr/lib/x86_64-linux-gnu/libcrypto.so
     [exec] JAVA_HOME=, JAVA_JVM_LIBRARY=/home/jenkins/tools/java/latest1.6-64/jre/lib/amd64/server/libjvm.so
     [exec] JAVA_INCLUDE_PATH=/home/jenkins/tools/java/latest1.6-64/include, JAVA_INCLUDE_PATH2=/home/jenkins/tools/java/latest1.6-64/include/linux
     [exec] Located all JNI components successfully.
     [exec] make: *** No targets specified and no makefile found.  Stop.
[INFO] ------------------------------------------------------------------------
[INFO] Reactor Summary:
[INFO] 
[INFO] Apache Hama parent POM ............................ SUCCESS [6.782s]
[INFO] pipes ............................................. FAILURE [2.084s]
[INFO] core .............................................. SKIPPED
[INFO] graph ............................................. SKIPPED
[INFO] machine learning .................................. SKIPPED
[INFO] examples .......................................... SKIPPED
[INFO] hama-dist ......................................... SKIPPED
[INFO] ------------------------------------------------------------------------
[INFO] BUILD FAILURE
[INFO] ------------------------------------------------------------------------
[INFO] Total time: 9.630s
[INFO] Finished at: Wed Oct 02 01:07:41 UTC 2013
[INFO] Final Memory: 16M/146M
[INFO] ------------------------------------------------------------------------
[ERROR] Failed to execute goal org.apache.maven.plugins:maven-antrun-plugin:1.6:run (make)
on project hama-pipes: An Ant BuildException has occured: exec returned: 2 -> [Help 1]
[ERROR] 
[ERROR] To see the full stack trace of the errors, re-run Maven with the -e switch.
[ERROR] Re-run Maven using the -X switch to enable full debug logging.
[ERROR] 
[ERROR] For more information about the errors and possible solutions, please read the following
articles:
[ERROR] [Help 1] http://cwiki.apache.org/confluence/display/MAVEN/MojoExecutionException
[ERROR] 
[ERROR] After correcting the problems, you can resume the build with the command
[ERROR]   mvn <goals> -rf :hama-pipes
Build step 'Invoke top-level Maven targets' marked build as failure
Archiving artifacts
Recording test results

Mime
View raw message