hama-dev mailing list archives

Site index · List index
Message view « Date » · « Thread »
Top « Date » · « Thread »
From "Edward J. Yoon" <edwardy...@apache.org>
Subject Re: Build failed in Jenkins: Hama-Nightly-for-Hadoop-2.x #37
Date Fri, 20 Sep 2013 02:37:34 GMT
YARN module seems need to be rewritten based on latest yarn APIs.

I don't think this is high priority. I'll fix by hard-coding the
hadoop-version in yarn module pom file.

On Fri, Sep 20, 2013 at 10:56 AM, Apache Jenkins Server
<jenkins@builds.apache.org> wrote:
> See <https://builds.apache.org/job/Hama-Nightly-for-Hadoop-2.x/37/changes>
>
> Changes:
>
> [edwardyoon] Remove SASL
>
> [edwardyoon] [maven-release-plugin] rollback the release of 0.6.3-RC2
>
> ------------------------------------------
> [...truncated 77816 lines...]
> [ERROR]  class BSPTaskLauncher
> <https://builds.apache.org/job/Hama-Nightly-for-Hadoop-2.x/ws/trunk/yarn/src/main/java/org/apache/hama/bsp/BSPTaskLauncher.java>:[83,38]
error: cannot find symbol
> [ERROR]  class BSPTaskLauncher
> <https://builds.apache.org/job/Hama-Nightly-for-Hadoop-2.x/ws/trunk/yarn/src/main/java/org/apache/hama/bsp/BSPTaskLauncher.java>:[118,36]
error: cannot find symbol
> [ERROR]  class BSPTaskLauncher
> <https://builds.apache.org/job/Hama-Nightly-for-Hadoop-2.x/ws/trunk/yarn/src/main/java/org/apache/hama/bsp/BSPTaskLauncher.java>:[117,10]
error: cannot find symbol
> [ERROR]  class BSPTaskLauncher
> <https://builds.apache.org/job/Hama-Nightly-for-Hadoop-2.x/ws/trunk/yarn/src/main/java/org/apache/hama/bsp/YARNBSPJob.java>:[27,33]
error: cannot find symbol
> [ERROR]  package org.apache.hadoop.yarn.api
> <https://builds.apache.org/job/Hama-Nightly-for-Hadoop-2.x/ws/trunk/yarn/src/main/java/org/apache/hama/bsp/YARNBSPJob.java>:[34,40]
error: cannot find symbol
> [ERROR]  package org.apache.hadoop.yarn.exceptions
> <https://builds.apache.org/job/Hama-Nightly-for-Hadoop-2.x/ws/trunk/yarn/src/main/java/org/apache/hama/bsp/YARNBSPJob.java>:[49,10]
error: cannot find symbol
> [ERROR]  class YARNBSPJob
> <https://builds.apache.org/job/Hama-Nightly-for-Hadoop-2.x/ws/trunk/yarn/src/main/java/org/apache/hama/bsp/YARNBSPJob.java>:[69,28]
error: cannot find symbol
> [ERROR]  class YARNBSPJob
> <https://builds.apache.org/job/Hama-Nightly-for-Hadoop-2.x/ws/trunk/yarn/src/main/java/org/apache/hama/bsp/YARNBSPJob.java>:[136,2]
error: cannot find symbol
> [ERROR]  class YARNBSPJob
> <https://builds.apache.org/job/Hama-Nightly-for-Hadoop-2.x/ws/trunk/yarn/src/main/java/org/apache/hama/bsp/YARNBSPJobClient.java>:[162,15]
error: cannot find symbol
> [ERROR]  variable amContainer of type ContainerLaunchContext
> <https://builds.apache.org/job/Hama-Nightly-for-Hadoop-2.x/ws/trunk/yarn/src/main/java/org/apache/hama/bsp/BSPApplicationMaster.java>:[119,21]
error: cannot find symbol
> [ERROR]  class BSPApplicationMaster
> <https://builds.apache.org/job/Hama-Nightly-for-Hadoop-2.x/ws/trunk/yarn/src/main/java/org/apache/hama/bsp/BSPApplicationMaster.java>:[162,27]
error: cannot find symbol
> [ERROR]  class RPC
> <https://builds.apache.org/job/Hama-Nightly-for-Hadoop-2.x/ws/trunk/yarn/src/main/java/org/apache/hama/bsp/BSPApplicationMaster.java>:[168,25]
error: cannot find symbol
> [ERROR]  class RPC
> <https://builds.apache.org/job/Hama-Nightly-for-Hadoop-2.x/ws/trunk/yarn/src/main/java/org/apache/hama/bsp/BSPApplicationMaster.java>:[200,12]
error: cannot find symbol
> [ERROR]  class BSPApplicationMaster
> <https://builds.apache.org/job/Hama-Nightly-for-Hadoop-2.x/ws/trunk/yarn/src/main/java/org/apache/hama/bsp/BSPApplicationMaster.java>:[200,43]
error: cannot find symbol
> [ERROR]  class BSPApplicationMaster
> <https://builds.apache.org/job/Hama-Nightly-for-Hadoop-2.x/ws/trunk/yarn/src/main/java/org/apache/hama/bsp/BSPApplicationMaster.java>:[215,20]
error: cannot find symbol
> [ERROR]  variable appMasterRequest of type RegisterApplicationMasterRequest
> <https://builds.apache.org/job/Hama-Nightly-for-Hadoop-2.x/ws/trunk/yarn/src/main/java/org/apache/hama/bsp/BSPApplicationMaster.java>:[237,46]
error: cannot find symbol
> [ERROR]  interface ApplicationConstants
> <https://builds.apache.org/job/Hama-Nightly-for-Hadoop-2.x/ws/trunk/yarn/src/main/java/org/apache/hama/bsp/BSPApplicationMaster.java>:[242,37]
error: cannot find symbol
> [ERROR]  interface ApplicationConstants
> <https://builds.apache.org/job/Hama-Nightly-for-Hadoop-2.x/ws/trunk/yarn/src/main/java/org/apache/hama/bsp/BSPApplicationMaster.java>:[271,13]
error: cannot find symbol
> [ERROR]  variable finishReq of type FinishApplicationMasterRequest
> <https://builds.apache.org/job/Hama-Nightly-for-Hadoop-2.x/ws/trunk/yarn/src/main/java/org/apache/hama/bsp/BSPApplicationMaster.java>:[274,17]
error: cannot find symbol
> [ERROR]  variable finishReq of type FinishApplicationMasterRequest
> <https://builds.apache.org/job/Hama-Nightly-for-Hadoop-2.x/ws/trunk/yarn/src/main/java/org/apache/hama/bsp/BSPApplicationMaster.java>:[277,17]
error: cannot find symbol
> [ERROR]  variable finishReq of type FinishApplicationMasterRequest
> <https://builds.apache.org/job/Hama-Nightly-for-Hadoop-2.x/ws/trunk/yarn/src/main/java/org/apache/hama/bsp/BSPApplicationMaster.java>:[280,17]
error: cannot find symbol
> [ERROR]  variable finishReq of type FinishApplicationMasterRequest
> <https://builds.apache.org/job/Hama-Nightly-for-Hadoop-2.x/ws/trunk/yarn/src/main/java/org/apache/hama/bsp/BSPApplicationMaster.java>:[283,17]
error: cannot find symbol
> [ERROR]  variable finishReq of type FinishApplicationMasterRequest
> <https://builds.apache.org/job/Hama-Nightly-for-Hadoop-2.x/ws/trunk/yarn/src/main/java/org/apache/hama/bsp/BSPTaskLauncher.java>:[84,4]
error: cannot find symbol
> [ERROR]  class BSPTaskLauncher
> <https://builds.apache.org/job/Hama-Nightly-for-Hadoop-2.x/ws/trunk/yarn/src/main/java/org/apache/hama/bsp/BSPTaskLauncher.java>:[85,19]
error: cannot find symbol
> [ERROR]  class BSPTaskLauncher
> <https://builds.apache.org/job/Hama-Nightly-for-Hadoop-2.x/ws/trunk/yarn/src/main/java/org/apache/hama/bsp/BSPTaskLauncher.java>:[126,7]
error: cannot find symbol
> [ERROR]  variable ctx of type ContainerLaunchContext
> <https://builds.apache.org/job/Hama-Nightly-for-Hadoop-2.x/ws/trunk/yarn/src/main/java/org/apache/hama/bsp/BSPTaskLauncher.java>:[127,7]
error: cannot find symbol
> [ERROR]  variable ctx of type ContainerLaunchContext
> <https://builds.apache.org/job/Hama-Nightly-for-Hadoop-2.x/ws/trunk/yarn/src/main/java/org/apache/hama/bsp/BSPTaskLauncher.java>:[128,7]
error: cannot find symbol
> [ERROR]  variable ctx of type ContainerLaunchContext
> <https://builds.apache.org/job/Hama-Nightly-for-Hadoop-2.x/ws/trunk/yarn/src/main/java/org/apache/hama/bsp/BSPTaskLauncher.java>:[187,4]
error: cannot find symbol
> [ERROR]  class BSPTaskLauncher
> <https://builds.apache.org/job/Hama-Nightly-for-Hadoop-2.x/ws/trunk/yarn/src/main/java/org/apache/hama/bsp/BSPTaskLauncher.java>:[188,19]
error: cannot find symbol
> [ERROR]  class BSPTaskLauncher
> <https://builds.apache.org/job/Hama-Nightly-for-Hadoop-2.x/ws/trunk/yarn/src/main/java/org/apache/hama/bsp/JobImpl.java>:[138,28]
error: cannot find symbol
> [ERROR]  class JobImpl
> <https://builds.apache.org/job/Hama-Nightly-for-Hadoop-2.x/ws/trunk/yarn/src/main/java/org/apache/hama/bsp/JobImpl.java>:[146,6]
error: cannot find symbol
> [ERROR]  class JobImpl
> <https://builds.apache.org/job/Hama-Nightly-for-Hadoop-2.x/ws/trunk/yarn/src/main/java/org/apache/hama/bsp/JobImpl.java>:[146,46]
error: cannot find symbol
> [ERROR]  variable allocateResponse of type AllocateResponse
> <https://builds.apache.org/job/Hama-Nightly-for-Hadoop-2.x/ws/trunk/yarn/src/main/java/org/apache/hama/bsp/JobImpl.java>:[170,30]
error: cannot find symbol
> [ERROR]  variable allocatedContainer of type Container
> <https://builds.apache.org/job/Hama-Nightly-for-Hadoop-2.x/ws/trunk/yarn/src/main/java/org/apache/hama/bsp/JobImpl.java>:[177,6]
error: cannot find symbol
> [ERROR]  class JobImpl
> <https://builds.apache.org/job/Hama-Nightly-for-Hadoop-2.x/ws/trunk/yarn/src/main/java/org/apache/hama/bsp/JobImpl.java>:[177,29]
error: cannot find symbol
> [ERROR]  class JobImpl
> <https://builds.apache.org/job/Hama-Nightly-for-Hadoop-2.x/ws/trunk/yarn/src/main/java/org/apache/hama/bsp/JobImpl.java>:[178,10]
error: cannot find symbol
> [ERROR]  class JobImpl
> <https://builds.apache.org/job/Hama-Nightly-for-Hadoop-2.x/ws/trunk/yarn/src/main/java/org/apache/hama/bsp/JobImpl.java>:[250,17]
error: cannot find symbol
> [ERROR]  variable rsrcRequest of type ResourceRequest
> <https://builds.apache.org/job/Hama-Nightly-for-Hadoop-2.x/ws/trunk/yarn/src/main/java/org/apache/hama/bsp/YARNBSPJob.java>:[61,33]
error: cannot find symbol
> [ERROR]  class YARNBSPJob
> <https://builds.apache.org/job/Hama-Nightly-for-Hadoop-2.x/ws/trunk/yarn/src/main/java/org/apache/hama/bsp/YARNBSPJob.java>:[62,8]
error: cannot find symbol
> [INFO] 69 errors
> [INFO] -------------------------------------------------------------
> [INFO] ------------------------------------------------------------------------
> [INFO] Reactor Summary:
> [INFO]
> [INFO] Apache Hama parent POM ............................ SUCCESS [11.825s]
> [INFO] pipes ............................................. SUCCESS [6.682s]
> [INFO] core .............................................. SUCCESS [2:42.141s]
> [INFO] graph ............................................. SUCCESS [29.461s]
> [INFO] machine learning .................................. SUCCESS [1:06.807s]
> [INFO] examples .......................................... SUCCESS [1:23.465s]
> [INFO] hama-dist ......................................... SUCCESS [15.884s]
> [INFO] yarn .............................................. FAILURE [1.867s]
> [INFO] ------------------------------------------------------------------------
> [INFO] BUILD FAILURE
> [INFO] ------------------------------------------------------------------------
> [INFO] Total time: 6:19.768s
> [INFO] Finished at: Fri Sep 20 01:56:39 UTC 2013
> [INFO] Final Memory: 111M/1134M
> [INFO] ------------------------------------------------------------------------
> [ERROR] Failed to execute goal org.apache.maven.plugins:maven-compiler-plugin:2.3.2:compile
(default-compile) on project hama-yarn: Compilation failure: Compilation failure:
> [ERROR] <https://builds.apache.org/job/Hama-Nightly-for-Hadoop-2.x/ws/trunk/yarn/src/main/java/org/apache/hama/bsp/BSPApplicationMaster.java>:[39,29]
error: cannot find symbol
> [ERROR] package org.apache.hadoop.yarn
> [ERROR] <https://builds.apache.org/job/Hama-Nightly-for-Hadoop-2.x/ws/trunk/yarn/src/main/java/org/apache/hama/bsp/BSPApplicationMaster.java>:[40,29]
error: cannot find symbol
> [ERROR] package org.apache.hadoop.yarn
> [ERROR] <https://builds.apache.org/job/Hama-Nightly-for-Hadoop-2.x/ws/trunk/yarn/src/main/java/org/apache/hama/bsp/BSPApplicationMaster.java>:[41,33]
error: cannot find symbol
> [ERROR] package org.apache.hadoop.yarn.api
> [ERROR] <https://builds.apache.org/job/Hama-Nightly-for-Hadoop-2.x/ws/trunk/yarn/src/main/java/org/apache/hama/bsp/BSPApplicationMaster.java>:[49,40]
error: cannot find symbol
> [ERROR] package org.apache.hadoop.yarn.exceptions
> [ERROR] <https://builds.apache.org/job/Hama-Nightly-for-Hadoop-2.x/ws/trunk/yarn/src/main/java/org/apache/hama/bsp/Job.java>:[20,40]
error: cannot find symbol
> [ERROR] package org.apache.hadoop.yarn.exceptions
> [ERROR] <https://builds.apache.org/job/Hama-Nightly-for-Hadoop-2.x/ws/trunk/yarn/src/main/java/org/apache/hama/bsp/BSPApplicationMaster.java>:[74,10]
error: cannot find symbol
> [ERROR] class BSPApplicationMaster
> [ERROR] <https://builds.apache.org/job/Hama-Nightly-for-Hadoop-2.x/ws/trunk/yarn/src/main/java/org/apache/hama/bsp/BSPApplicationMaster.java>:[76,10]
error: cannot find symbol
> [ERROR] class BSPApplicationMaster
> [ERROR] <https://builds.apache.org/job/Hama-Nightly-for-Hadoop-2.x/ws/trunk/yarn/src/main/java/org/apache/hama/bsp/JobImpl.java>:[34,33]
error: cannot find symbol
> [ERROR] package org.apache.hadoop.yarn.api
> [ERROR] <https://builds.apache.org/job/Hama-Nightly-for-Hadoop-2.x/ws/trunk/yarn/src/main/java/org/apache/hama/bsp/JobImpl.java>:[35,33]
error: cannot find symbol
> [ERROR] package org.apache.hadoop.yarn.api
> [ERROR] <https://builds.apache.org/job/Hama-Nightly-for-Hadoop-2.x/ws/trunk/yarn/src/main/java/org/apache/hama/bsp/JobImpl.java>:[38,41]
error: cannot find symbol
> [ERROR] package org.apache.hadoop.yarn.api.records
> [ERROR] <https://builds.apache.org/job/Hama-Nightly-for-Hadoop-2.x/ws/trunk/yarn/src/main/java/org/apache/hama/bsp/JobImpl.java>:[45,40]
error: cannot find symbol
> [ERROR] package org.apache.hadoop.yarn.exceptions
> [ERROR] <https://builds.apache.org/job/Hama-Nightly-for-Hadoop-2.x/ws/trunk/yarn/src/main/java/org/apache/hama/bsp/JobImpl.java>:[47,34]
error: cannot find symbol
> [ERROR] package org.apache.hadoop.yarn.util
> [ERROR] <https://builds.apache.org/job/Hama-Nightly-for-Hadoop-2.x/ws/trunk/yarn/src/main/java/org/apache/hama/bsp/BSPTaskLauncher.java>:[32,33]
error: cannot find symbol
> [ERROR] package org.apache.hadoop.yarn.api
> [ERROR] <https://builds.apache.org/job/Hama-Nightly-for-Hadoop-2.x/ws/trunk/yarn/src/main/java/org/apache/hama/bsp/BSPTaskLauncher.java>:[33,49]
error: cannot find symbol
> [ERROR] package org.apache.hadoop.yarn.api.protocolrecords
> [ERROR] <https://builds.apache.org/job/Hama-Nightly-for-Hadoop-2.x/ws/trunk/yarn/src/main/java/org/apache/hama/bsp/BSPTaskLauncher.java>:[35,49]
error: cannot find symbol
> [ERROR] package org.apache.hadoop.yarn.api.protocolrecords
> [ERROR] <https://builds.apache.org/job/Hama-Nightly-for-Hadoop-2.x/ws/trunk/yarn/src/main/java/org/apache/hama/bsp/BSPTaskLauncher.java>:[44,40]
error: cannot find symbol
> [ERROR] package org.apache.hadoop.yarn.exceptions
> [ERROR] <https://builds.apache.org/job/Hama-Nightly-for-Hadoop-2.x/ws/trunk/yarn/src/main/java/org/apache/hama/bsp/BSPApplicationMaster.java>:[194,10]
error: cannot find symbol
> [ERROR] class BSPApplicationMaster
> [ERROR] <https://builds.apache.org/job/Hama-Nightly-for-Hadoop-2.x/ws/trunk/yarn/src/main/java/org/apache/hama/bsp/BSPApplicationMaster.java>:[209,6]
error: cannot find symbol
> [ERROR] class BSPApplicationMaster
> [ERROR] <https://builds.apache.org/job/Hama-Nightly-for-Hadoop-2.x/ws/trunk/yarn/src/main/java/org/apache/hama/bsp/BSPApplicationMaster.java>:[211,42]
error: cannot find symbol
> [ERROR] class BSPApplicationMaster
> [ERROR] <https://builds.apache.org/job/Hama-Nightly-for-Hadoop-2.x/ws/trunk/yarn/src/main/java/org/apache/hama/bsp/BSPApplicationMaster.java>:[262,32]
error: cannot find symbol
> [ERROR] class BSPApplicationMaster
> [ERROR] <https://builds.apache.org/job/Hama-Nightly-for-Hadoop-2.x/ws/trunk/yarn/src/main/java/org/apache/hama/bsp/BSPApplicationMaster.java>:[288,48]
error: cannot find symbol
> [ERROR] class BSPApplicationMaster
> [ERROR] <https://builds.apache.org/job/Hama-Nightly-for-Hadoop-2.x/ws/trunk/yarn/src/main/java/org/apache/hama/bsp/Job.java>:[37,31]
error: cannot find symbol
> [ERROR] interface Job
> [ERROR] <https://builds.apache.org/job/Hama-Nightly-for-Hadoop-2.x/ws/trunk/yarn/src/main/java/org/apache/hama/bsp/JobImpl.java>:[69,10]
error: cannot find symbol
> [ERROR] class JobImpl
> [ERROR] <https://builds.apache.org/job/Hama-Nightly-for-Hadoop-2.x/ws/trunk/yarn/src/main/java/org/apache/hama/bsp/JobImpl.java>:[80,55]
error: cannot find symbol
> [ERROR] class JobImpl
> [ERROR] <https://builds.apache.org/job/Hama-Nightly-for-Hadoop-2.x/ws/trunk/yarn/src/main/java/org/apache/hama/bsp/JobImpl.java>:[224,42]
error: cannot find symbol
> [ERROR] class JobImpl
> [ERROR] <https://builds.apache.org/job/Hama-Nightly-for-Hadoop-2.x/ws/trunk/yarn/src/main/java/org/apache/hama/bsp/JobImpl.java>:[232,31]
error: cannot find symbol
> [ERROR] class JobImpl
> [ERROR] <https://builds.apache.org/job/Hama-Nightly-for-Hadoop-2.x/ws/trunk/yarn/src/main/java/org/apache/hama/bsp/BSPTaskLauncher.java>:[54,16]
error: cannot find symbol
> [ERROR] class BSPTaskLauncher
> [ERROR] <https://builds.apache.org/job/Hama-Nightly-for-Hadoop-2.x/ws/trunk/yarn/src/main/java/org/apache/hama/bsp/BSPTaskLauncher.java>:[60,10]
error: cannot find symbol
> [ERROR] class BSPTaskLauncher
> [ERROR] <https://builds.apache.org/job/Hama-Nightly-for-Hadoop-2.x/ws/trunk/yarn/src/main/java/org/apache/hama/bsp/BSPTaskLauncher.java>:[62,54]
error: cannot find symbol
> [ERROR] class BSPTaskLauncher
> [ERROR] <https://builds.apache.org/job/Hama-Nightly-for-Hadoop-2.x/ws/trunk/yarn/src/main/java/org/apache/hama/bsp/BSPTaskLauncher.java>:[64,13]
error: cannot find symbol
> [ERROR] class BSPTaskLauncher
> [ERROR] <https://builds.apache.org/job/Hama-Nightly-for-Hadoop-2.x/ws/trunk/yarn/src/main/java/org/apache/hama/bsp/BSPTaskLauncher.java>:[83,38]
error: cannot find symbol
> [ERROR] class BSPTaskLauncher
> [ERROR] <https://builds.apache.org/job/Hama-Nightly-for-Hadoop-2.x/ws/trunk/yarn/src/main/java/org/apache/hama/bsp/BSPTaskLauncher.java>:[118,36]
error: cannot find symbol
> [ERROR] class BSPTaskLauncher
> [ERROR] <https://builds.apache.org/job/Hama-Nightly-for-Hadoop-2.x/ws/trunk/yarn/src/main/java/org/apache/hama/bsp/BSPTaskLauncher.java>:[117,10]
error: cannot find symbol
> [ERROR] class BSPTaskLauncher
> [ERROR] <https://builds.apache.org/job/Hama-Nightly-for-Hadoop-2.x/ws/trunk/yarn/src/main/java/org/apache/hama/bsp/YARNBSPJob.java>:[27,33]
error: cannot find symbol
> [ERROR] package org.apache.hadoop.yarn.api
> [ERROR] <https://builds.apache.org/job/Hama-Nightly-for-Hadoop-2.x/ws/trunk/yarn/src/main/java/org/apache/hama/bsp/YARNBSPJob.java>:[34,40]
error: cannot find symbol
> [ERROR] package org.apache.hadoop.yarn.exceptions
> [ERROR] <https://builds.apache.org/job/Hama-Nightly-for-Hadoop-2.x/ws/trunk/yarn/src/main/java/org/apache/hama/bsp/YARNBSPJob.java>:[49,10]
error: cannot find symbol
> [ERROR] class YARNBSPJob
> [ERROR] <https://builds.apache.org/job/Hama-Nightly-for-Hadoop-2.x/ws/trunk/yarn/src/main/java/org/apache/hama/bsp/YARNBSPJob.java>:[69,28]
error: cannot find symbol
> [ERROR] class YARNBSPJob
> [ERROR] <https://builds.apache.org/job/Hama-Nightly-for-Hadoop-2.x/ws/trunk/yarn/src/main/java/org/apache/hama/bsp/YARNBSPJob.java>:[136,2]
error: cannot find symbol
> [ERROR] class YARNBSPJob
> [ERROR] <https://builds.apache.org/job/Hama-Nightly-for-Hadoop-2.x/ws/trunk/yarn/src/main/java/org/apache/hama/bsp/YARNBSPJobClient.java>:[162,15]
error: cannot find symbol
> [ERROR] variable amContainer of type ContainerLaunchContext
> [ERROR] <https://builds.apache.org/job/Hama-Nightly-for-Hadoop-2.x/ws/trunk/yarn/src/main/java/org/apache/hama/bsp/BSPApplicationMaster.java>:[119,21]
error: cannot find symbol
> [ERROR] class BSPApplicationMaster
> [ERROR] <https://builds.apache.org/job/Hama-Nightly-for-Hadoop-2.x/ws/trunk/yarn/src/main/java/org/apache/hama/bsp/BSPApplicationMaster.java>:[162,27]
error: cannot find symbol
> [ERROR] class RPC
> [ERROR] <https://builds.apache.org/job/Hama-Nightly-for-Hadoop-2.x/ws/trunk/yarn/src/main/java/org/apache/hama/bsp/BSPApplicationMaster.java>:[168,25]
error: cannot find symbol
> [ERROR] class RPC
> [ERROR] <https://builds.apache.org/job/Hama-Nightly-for-Hadoop-2.x/ws/trunk/yarn/src/main/java/org/apache/hama/bsp/BSPApplicationMaster.java>:[200,12]
error: cannot find symbol
> [ERROR] class BSPApplicationMaster
> [ERROR] <https://builds.apache.org/job/Hama-Nightly-for-Hadoop-2.x/ws/trunk/yarn/src/main/java/org/apache/hama/bsp/BSPApplicationMaster.java>:[200,43]
error: cannot find symbol
> [ERROR] class BSPApplicationMaster
> [ERROR] <https://builds.apache.org/job/Hama-Nightly-for-Hadoop-2.x/ws/trunk/yarn/src/main/java/org/apache/hama/bsp/BSPApplicationMaster.java>:[215,20]
error: cannot find symbol
> [ERROR] variable appMasterRequest of type RegisterApplicationMasterRequest
> [ERROR] <https://builds.apache.org/job/Hama-Nightly-for-Hadoop-2.x/ws/trunk/yarn/src/main/java/org/apache/hama/bsp/BSPApplicationMaster.java>:[237,46]
error: cannot find symbol
> [ERROR] interface ApplicationConstants
> [ERROR] <https://builds.apache.org/job/Hama-Nightly-for-Hadoop-2.x/ws/trunk/yarn/src/main/java/org/apache/hama/bsp/BSPApplicationMaster.java>:[242,37]
error: cannot find symbol
> [ERROR] interface ApplicationConstants
> [ERROR] <https://builds.apache.org/job/Hama-Nightly-for-Hadoop-2.x/ws/trunk/yarn/src/main/java/org/apache/hama/bsp/BSPApplicationMaster.java>:[271,13]
error: cannot find symbol
> [ERROR] variable finishReq of type FinishApplicationMasterRequest
> [ERROR] <https://builds.apache.org/job/Hama-Nightly-for-Hadoop-2.x/ws/trunk/yarn/src/main/java/org/apache/hama/bsp/BSPApplicationMaster.java>:[274,17]
error: cannot find symbol
> [ERROR] variable finishReq of type FinishApplicationMasterRequest
> [ERROR] <https://builds.apache.org/job/Hama-Nightly-for-Hadoop-2.x/ws/trunk/yarn/src/main/java/org/apache/hama/bsp/BSPApplicationMaster.java>:[277,17]
error: cannot find symbol
> [ERROR] variable finishReq of type FinishApplicationMasterRequest
> [ERROR] <https://builds.apache.org/job/Hama-Nightly-for-Hadoop-2.x/ws/trunk/yarn/src/main/java/org/apache/hama/bsp/BSPApplicationMaster.java>:[280,17]
error: cannot find symbol
> [ERROR] variable finishReq of type FinishApplicationMasterRequest
> [ERROR] <https://builds.apache.org/job/Hama-Nightly-for-Hadoop-2.x/ws/trunk/yarn/src/main/java/org/apache/hama/bsp/BSPApplicationMaster.java>:[283,17]
error: cannot find symbol
> [ERROR] variable finishReq of type FinishApplicationMasterRequest
> [ERROR] <https://builds.apache.org/job/Hama-Nightly-for-Hadoop-2.x/ws/trunk/yarn/src/main/java/org/apache/hama/bsp/BSPTaskLauncher.java>:[84,4]
error: cannot find symbol
> [ERROR] class BSPTaskLauncher
> [ERROR] <https://builds.apache.org/job/Hama-Nightly-for-Hadoop-2.x/ws/trunk/yarn/src/main/java/org/apache/hama/bsp/BSPTaskLauncher.java>:[85,19]
error: cannot find symbol
> [ERROR] class BSPTaskLauncher
> [ERROR] <https://builds.apache.org/job/Hama-Nightly-for-Hadoop-2.x/ws/trunk/yarn/src/main/java/org/apache/hama/bsp/BSPTaskLauncher.java>:[126,7]
error: cannot find symbol
> [ERROR] variable ctx of type ContainerLaunchContext
> [ERROR] <https://builds.apache.org/job/Hama-Nightly-for-Hadoop-2.x/ws/trunk/yarn/src/main/java/org/apache/hama/bsp/BSPTaskLauncher.java>:[127,7]
error: cannot find symbol
> [ERROR] variable ctx of type ContainerLaunchContext
> [ERROR] <https://builds.apache.org/job/Hama-Nightly-for-Hadoop-2.x/ws/trunk/yarn/src/main/java/org/apache/hama/bsp/BSPTaskLauncher.java>:[128,7]
error: cannot find symbol
> [ERROR] variable ctx of type ContainerLaunchContext
> [ERROR] <https://builds.apache.org/job/Hama-Nightly-for-Hadoop-2.x/ws/trunk/yarn/src/main/java/org/apache/hama/bsp/BSPTaskLauncher.java>:[187,4]
error: cannot find symbol
> [ERROR] class BSPTaskLauncher
> [ERROR] <https://builds.apache.org/job/Hama-Nightly-for-Hadoop-2.x/ws/trunk/yarn/src/main/java/org/apache/hama/bsp/BSPTaskLauncher.java>:[188,19]
error: cannot find symbol
> [ERROR] class BSPTaskLauncher
> [ERROR] <https://builds.apache.org/job/Hama-Nightly-for-Hadoop-2.x/ws/trunk/yarn/src/main/java/org/apache/hama/bsp/JobImpl.java>:[138,28]
error: cannot find symbol
> [ERROR] class JobImpl
> [ERROR] <https://builds.apache.org/job/Hama-Nightly-for-Hadoop-2.x/ws/trunk/yarn/src/main/java/org/apache/hama/bsp/JobImpl.java>:[146,6]
error: cannot find symbol
> [ERROR] class JobImpl
> [ERROR] <https://builds.apache.org/job/Hama-Nightly-for-Hadoop-2.x/ws/trunk/yarn/src/main/java/org/apache/hama/bsp/JobImpl.java>:[146,46]
error: cannot find symbol
> [ERROR] variable allocateResponse of type AllocateResponse
> [ERROR] <https://builds.apache.org/job/Hama-Nightly-for-Hadoop-2.x/ws/trunk/yarn/src/main/java/org/apache/hama/bsp/JobImpl.java>:[170,30]
error: cannot find symbol
> [ERROR] variable allocatedContainer of type Container
> [ERROR] <https://builds.apache.org/job/Hama-Nightly-for-Hadoop-2.x/ws/trunk/yarn/src/main/java/org/apache/hama/bsp/JobImpl.java>:[177,6]
error: cannot find symbol
> [ERROR] class JobImpl
> [ERROR] <https://builds.apache.org/job/Hama-Nightly-for-Hadoop-2.x/ws/trunk/yarn/src/main/java/org/apache/hama/bsp/JobImpl.java>:[177,29]
error: cannot find symbol
> [ERROR] class JobImpl
> [ERROR] <https://builds.apache.org/job/Hama-Nightly-for-Hadoop-2.x/ws/trunk/yarn/src/main/java/org/apache/hama/bsp/JobImpl.java>:[178,10]
error: cannot find symbol
> [ERROR] class JobImpl
> [ERROR] <https://builds.apache.org/job/Hama-Nightly-for-Hadoop-2.x/ws/trunk/yarn/src/main/java/org/apache/hama/bsp/JobImpl.java>:[250,17]
error: cannot find symbol
> [ERROR] variable rsrcRequest of type ResourceRequest
> [ERROR] <https://builds.apache.org/job/Hama-Nightly-for-Hadoop-2.x/ws/trunk/yarn/src/main/java/org/apache/hama/bsp/YARNBSPJob.java>:[61,33]
error: cannot find symbol
> [ERROR] class YARNBSPJob
> [ERROR] <https://builds.apache.org/job/Hama-Nightly-for-Hadoop-2.x/ws/trunk/yarn/src/main/java/org/apache/hama/bsp/YARNBSPJob.java>:[62,8]
error: cannot find symbol
> [ERROR] -> [Help 1]
> [ERROR]
> [ERROR] To see the full stack trace of the errors, re-run Maven with the -e switch.
> [ERROR] Re-run Maven using the -X switch to enable full debug logging.
> [ERROR]
> [ERROR] For more information about the errors and possible solutions, please read the
following articles:
> [ERROR] [Help 1] http://cwiki.apache.org/confluence/display/MAVEN/MojoFailureException
> [ERROR]
> [ERROR] After correcting the problems, you can resume the build with the command
> [ERROR]   mvn <goals> -rf :hama-yarn
> Build step 'Invoke top-level Maven targets' marked build as failure
> Archiving artifacts
> Recording test results



-- 
Best Regards, Edward J. Yoon
@eddieyoon

Mime
View raw message