hama-dev mailing list archives

Site index · List index
Message view « Date » · « Thread »
Top « Date » · « Thread »
From Apache Jenkins Server <jenk...@builds.apache.org>
Subject Build failed in Jenkins: Hama-Nightly-for-Hadoop-2.x #43
Date Tue, 24 Sep 2013 23:45:51 GMT
See <https://builds.apache.org/job/Hama-Nightly-for-Hadoop-2.x/43/changes>

Changes:

[yxjiang] HAMA-804: Create NeuralNetwork Example.

------------------------------------------
[...truncated 77108 lines...]

13/09/24 23:44:50 INFO bsp.FileInputFormat: Total input paths to process : 1

13/09/24 23:44:50 WARN bsp.BSPJobClient: No job jar file set.  User classes may not be found.
See BSPJob#setJar(String) or check Your jar file.

13/09/24 23:44:50 INFO bsp.BSPJobClient: Running job: job_localrunner_0001

13/09/24 23:44:50 INFO bsp.LocalBSPRunner: Setting up a new barrier for 1 tasks!

13/09/24 23:44:53 INFO bsp.BSPJobClient: Current supersteps number: 1

13/09/24 23:44:53 INFO bsp.BSPJobClient: The total number of supersteps: 1

13/09/24 23:44:53 INFO bsp.BSPJobClient: Counters: 6

13/09/24 23:44:53 INFO bsp.BSPJobClient:   org.apache.hama.bsp.JobInProgress$JobCounter

13/09/24 23:44:53 INFO bsp.BSPJobClient:     SUPERSTEPS=1

13/09/24 23:44:53 INFO bsp.BSPJobClient:     LAUNCHED_TASKS=1

13/09/24 23:44:53 INFO bsp.BSPJobClient:   org.apache.hama.bsp.BSPPeerImpl$PeerCounter

13/09/24 23:44:53 INFO bsp.BSPJobClient:     SUPERSTEP_SUM=2

13/09/24 23:44:53 INFO bsp.BSPJobClient:     IO_BYTES_READ=32

13/09/24 23:44:53 INFO bsp.BSPJobClient:     TIME_IN_SYNC_MS=0

13/09/24 23:44:53 INFO bsp.BSPJobClient:     TASK_INPUT_RECORDS=4

13/09/24 23:44:53 INFO bsp.FileInputFormat: Total input paths to process : 2

13/09/24 23:44:53 WARN bsp.BSPJobClient: No job jar file set.  User classes may not be found.
See BSPJob#setJar(String) or check Your jar file.

13/09/24 23:44:53 INFO bsp.BSPJobClient: Running job: job_localrunner_0001

13/09/24 23:44:53 INFO bsp.LocalBSPRunner: Setting up a new barrier for 2 tasks!

13/09/24 23:44:53 INFO graph.GraphJobRunner: 2 vertices are loaded into local:0

13/09/24 23:44:53 INFO graph.GraphJobRunner: 2 vertices are loaded into local:1

13/09/24 23:44:56 INFO bsp.BSPJobClient: Current supersteps number: 7

13/09/24 23:44:56 INFO bsp.BSPJobClient: The total number of supersteps: 7

13/09/24 23:44:56 INFO bsp.BSPJobClient: Counters: 11

13/09/24 23:44:56 INFO bsp.BSPJobClient:   org.apache.hama.graph.GraphJobRunner$GraphJobCounter

13/09/24 23:44:56 INFO bsp.BSPJobClient:     ITERATIONS=6

13/09/24 23:44:56 INFO bsp.BSPJobClient:     INPUT_VERTICES=4

13/09/24 23:44:56 INFO bsp.BSPJobClient:   org.apache.hama.bsp.JobInProgress$JobCounter

13/09/24 23:44:56 INFO bsp.BSPJobClient:     SUPERSTEPS=7

13/09/24 23:44:56 INFO bsp.BSPJobClient:     LAUNCHED_TASKS=2

13/09/24 23:44:56 INFO bsp.BSPJobClient:   org.apache.hama.bsp.BSPPeerImpl$PeerCounter

13/09/24 23:44:56 INFO bsp.BSPJobClient:     SUPERSTEP_SUM=16

13/09/24 23:44:56 INFO bsp.BSPJobClient:     IO_BYTES_READ=96

13/09/24 23:44:56 INFO bsp.BSPJobClient:     TIME_IN_SYNC_MS=14

13/09/24 23:44:56 INFO bsp.BSPJobClient:     TOTAL_MESSAGES_SENT=40

13/09/24 23:44:56 INFO bsp.BSPJobClient:     TASK_INPUT_RECORDS=4

13/09/24 23:44:56 INFO bsp.BSPJobClient:     TOTAL_MESSAGES_RECEIVED=38

13/09/24 23:44:56 INFO bsp.BSPJobClient:     TASK_OUTPUT_RECORDS=4

Job Finished in 6.38 seconds
A -> D L expvalue = D L
C -> B L expvalue = B L
B -> C R expvalue = C R
D -> A R expvalue = A R
Tests run: 1, Failures: 0, Errors: 0, Skipped: 0, Time elapsed: 0.01 sec
Running org.apache.hama.examples.SemiClusterMatchingTest
13/09/24 23:44:57 WARN util.NativeCodeLoader: Unable to load native-hadoop library for your
platform... using builtin-java classes where applicable

13/09/24 23:44:57 INFO bsp.FileInputFormat: Total input paths to process : 1

13/09/24 23:44:57 WARN snappy.LoadSnappy: Snappy native library not loaded

13/09/24 23:44:57 INFO bsp.FileInputFormat: Total input paths to process : 1

13/09/24 23:44:57 WARN bsp.BSPJobClient: No job jar file set.  User classes may not be found.
See BSPJob#setJar(String) or check Your jar file.

13/09/24 23:44:57 INFO bsp.BSPJobClient: Running job: job_localrunner_0001

13/09/24 23:44:57 INFO bsp.LocalBSPRunner: Setting up a new barrier for 1 tasks!

13/09/24 23:45:00 INFO bsp.BSPJobClient: Current supersteps number: 1

13/09/24 23:45:00 INFO bsp.BSPJobClient: The total number of supersteps: 1

13/09/24 23:45:00 INFO bsp.BSPJobClient: Counters: 6

13/09/24 23:45:00 INFO bsp.BSPJobClient:   org.apache.hama.bsp.JobInProgress$JobCounter

13/09/24 23:45:00 INFO bsp.BSPJobClient:     SUPERSTEPS=1

13/09/24 23:45:00 INFO bsp.BSPJobClient:     LAUNCHED_TASKS=1

13/09/24 23:45:00 INFO bsp.BSPJobClient:   org.apache.hama.bsp.BSPPeerImpl$PeerCounter

13/09/24 23:45:00 INFO bsp.BSPJobClient:     SUPERSTEP_SUM=2

13/09/24 23:45:00 INFO bsp.BSPJobClient:     IO_BYTES_READ=23990

13/09/24 23:45:00 INFO bsp.BSPJobClient:     TIME_IN_SYNC_MS=1

13/09/24 23:45:00 INFO bsp.BSPJobClient:     TASK_INPUT_RECORDS=300

13/09/24 23:45:00 INFO bsp.FileInputFormat: Total input paths to process : 1

13/09/24 23:45:00 WARN bsp.BSPJobClient: No job jar file set.  User classes may not be found.
See BSPJob#setJar(String) or check Your jar file.

13/09/24 23:45:00 INFO bsp.BSPJobClient: Running job: job_localrunner_0001

13/09/24 23:45:00 INFO bsp.LocalBSPRunner: Setting up a new barrier for 1 tasks!

13/09/24 23:45:00 INFO graph.GraphJobRunner: 300 vertices are loaded into local:0

13/09/24 23:45:03 INFO bsp.BSPJobClient: Current supersteps number: 3

13/09/24 23:45:06 INFO bsp.BSPJobClient: Current supersteps number: 4

13/09/24 23:45:09 INFO bsp.BSPJobClient: Current supersteps number: 5

13/09/24 23:45:15 INFO bsp.BSPJobClient: Current supersteps number: 6

13/09/24 23:45:18 INFO bsp.BSPJobClient: Current supersteps number: 7

13/09/24 23:45:21 INFO bsp.BSPJobClient: Current supersteps number: 8

13/09/24 23:45:24 INFO bsp.BSPJobClient: Current supersteps number: 9

13/09/24 23:45:27 INFO bsp.BSPJobClient: Current supersteps number: 10

13/09/24 23:45:30 INFO bsp.BSPJobClient: Current supersteps number: 11

13/09/24 23:45:33 INFO bsp.BSPJobClient: Current supersteps number: 12

13/09/24 23:45:36 INFO bsp.BSPJobClient: Current supersteps number: 13

13/09/24 23:45:39 INFO bsp.BSPJobClient: Current supersteps number: 14

13/09/24 23:45:42 INFO bsp.BSPJobClient: Current supersteps number: 15

13/09/24 23:45:45 INFO bsp.BSPJobClient: The total number of supersteps: 15

13/09/24 23:45:45 INFO bsp.BSPJobClient: Counters: 11

13/09/24 23:45:45 INFO bsp.BSPJobClient:   org.apache.hama.graph.GraphJobRunner$GraphJobCounter

13/09/24 23:45:45 INFO bsp.BSPJobClient:     ITERATIONS=15

13/09/24 23:45:45 INFO bsp.BSPJobClient:     INPUT_VERTICES=300

13/09/24 23:45:45 INFO bsp.BSPJobClient:   org.apache.hama.bsp.JobInProgress$JobCounter

13/09/24 23:45:45 INFO bsp.BSPJobClient:     SUPERSTEPS=15

13/09/24 23:45:45 INFO bsp.BSPJobClient:     LAUNCHED_TASKS=1

13/09/24 23:45:45 INFO bsp.BSPJobClient:   org.apache.hama.bsp.BSPPeerImpl$PeerCounter

13/09/24 23:45:45 INFO bsp.BSPJobClient:     SUPERSTEP_SUM=16

13/09/24 23:45:45 INFO bsp.BSPJobClient:     IO_BYTES_READ=29070

13/09/24 23:45:45 INFO bsp.BSPJobClient:     TIME_IN_SYNC_MS=3

13/09/24 23:45:45 INFO bsp.BSPJobClient:     TOTAL_MESSAGES_SENT=4699232

13/09/24 23:45:45 INFO bsp.BSPJobClient:     TASK_INPUT_RECORDS=300

13/09/24 23:45:45 INFO bsp.BSPJobClient:     TOTAL_MESSAGES_RECEIVED=4365930

13/09/24 23:45:45 INFO bsp.BSPJobClient:     TASK_OUTPUT_RECORDS=300

Job Finished in 48.309 seconds
Tests run: 1, Failures: 0, Errors: 0, Skipped: 0, Time elapsed: 0.008 sec

Results :

Tests run: 20, Failures: 0, Errors: 0, Skipped: 0

[INFO] 
[INFO] --- maven-jar-plugin:2.3:jar (default-jar) @ hama-examples ---
[INFO] Building jar: <https://builds.apache.org/job/Hama-Nightly-for-Hadoop-2.x/ws/trunk/examples/target/hama-examples-0.6.3-SNAPSHOT.jar>
[INFO] 
[INFO] --- apache-rat-plugin:0.8:check (default) @ hama-examples ---
[INFO] Exclude: .idea/**
[INFO] Exclude: .git/**
[INFO] Exclude: .gitignore
[INFO] Exclude: **/.classpath/**
[INFO] Exclude: **/.project
[INFO] Exclude: **/*.iml
[INFO] Exclude: **/.settings/**
[INFO] Exclude: **/*.asc
[INFO] Exclude: **/dependency-reduced-pom.xml
[INFO] Exclude: **/logs/**
[INFO] Exclude: **/docs/**
[INFO] Exclude: CHANGES.txt
[INFO] Exclude: conf/groomservers
[INFO] Exclude: src/site/resources/files/hama-eclipse-formatter.xml
[INFO] Exclude: **/src/test/resources/*.properties
[INFO] Exclude: **dependency-reduced-pom.xml
[INFO] Exclude: **/src/test/resources/*.txt
[INFO] Exclude: **/target/**
[INFO] ------------------------------------------------------------------------
[INFO] Reactor Summary:
[INFO] 
[INFO] Apache Hama parent POM ............................ SUCCESS [12.339s]
[INFO] pipes ............................................. SUCCESS [11.523s]
[INFO] core .............................................. SUCCESS [2:50.361s]
[INFO] graph ............................................. SUCCESS [36.663s]
[INFO] machine learning .................................. SUCCESS [1:13.870s]
[INFO] examples .......................................... FAILURE [2:23.440s]
[INFO] hama-dist ......................................... SKIPPED
[INFO] ------------------------------------------------------------------------
[INFO] BUILD FAILURE
[INFO] ------------------------------------------------------------------------
[INFO] Total time: 7:31.655s
[INFO] Finished at: Tue Sep 24 23:45:46 UTC 2013
[INFO] Final Memory: 97M/242M
[INFO] ------------------------------------------------------------------------
[ERROR] Failed to execute goal org.apache.rat:apache-rat-plugin:0.8:check (default) on project
hama-examples: Too many unapproved licenses: 1 -> [Help 1]
[ERROR] 
[ERROR] To see the full stack trace of the errors, re-run Maven with the -e switch.
[ERROR] Re-run Maven using the -X switch to enable full debug logging.
[ERROR] 
[ERROR] For more information about the errors and possible solutions, please read the following
articles:
[ERROR] [Help 1] http://cwiki.apache.org/confluence/display/MAVEN/MojoFailureException
[ERROR] 
[ERROR] After correcting the problems, you can resume the build with the command
[ERROR]   mvn <goals> -rf :hama-examples
Build step 'Invoke top-level Maven targets' marked build as failure
Archiving artifacts
Recording test results
Updating HAMA-804

Mime
View raw message