hama-dev mailing list archives

Site index · List index
Message view « Date » · « Thread »
Top « Date » · « Thread »
From Apache Jenkins Server <jenk...@builds.apache.org>
Subject Build failed in Jenkins: Hama-Nightly-for-Hadoop-2.x #24
Date Sat, 07 Sep 2013 23:03:54 GMT
See <https://builds.apache.org/job/Hama-Nightly-for-Hadoop-2.x/24/>

------------------------------------------
[...truncated 852 lines...]
     [exec] make[1]: Leaving directory `/x1/jenkins/jenkins-slave/workspace/Hama-Nightly-for-Hadoop-2.x/trunk/c++/target/native'
     [exec] /usr/bin/cmake -E cmake_progress_start /x1/jenkins/jenkins-slave/workspace/Hama-Nightly-for-Hadoop-2.x/trunk/c++/target/native/CMakeFiles
0
     [exec] [ 66%] Built target hadooputils
     [exec] [100%] Built target hamapipes
[INFO] Executed tasks
[INFO] 
[INFO] --- apache-rat-plugin:0.8:check (default) @ hama-pipes ---
[INFO] Exclude: .idea/**
[INFO] Exclude: .git/**
[INFO] Exclude: .gitignore
[INFO] Exclude: **/.classpath/**
[INFO] Exclude: **/.project
[INFO] Exclude: **/*.iml
[INFO] Exclude: **/.settings/**
[INFO] Exclude: **/*.asc
[INFO] Exclude: **/dependency-reduced-pom.xml
[INFO] Exclude: **/logs/**
[INFO] Exclude: **/docs/**
[INFO] Exclude: CHANGES.txt
[INFO] Exclude: conf/groomservers
[INFO] Exclude: src/site/resources/files/hama-eclipse-formatter.xml
[INFO] Exclude: **/src/test/resources/*.properties
[INFO] Exclude: **dependency-reduced-pom.xml
[INFO] Exclude: **/src/test/resources/*.txt
[INFO] Exclude: **/target/**
[INFO] 
[INFO] --- maven-javadoc-plugin:2.8.1:jar (default) @ hama-pipes ---
[INFO] Not executing Javadoc as the project is not a Java classpath-capable package
[INFO] 
[INFO] --- maven-install-plugin:2.3:install (default-install) @ hama-pipes ---
[INFO] Installing /x1/jenkins/jenkins-slave/workspace/Hama-Nightly-for-Hadoop-2.x/trunk/c++/pom.xml
to <https://builds.apache.org/job/Hama-Nightly-for-Hadoop-2.x/ws/.repository/org/apache/hama/hama-pipes/0.6.3-SNAPSHOT/hama-pipes-0.6.3-SNAPSHOT.pom>
[INFO]                                                                         
[INFO] ------------------------------------------------------------------------
[INFO] Building core 0.6.3-SNAPSHOT
[INFO] ------------------------------------------------------------------------
[INFO] 
[INFO] --- maven-clean-plugin:2.4.1:clean (default-clean) @ hama-core ---
[INFO] Deleting /x1/jenkins/jenkins-slave/workspace/Hama-Nightly-for-Hadoop-2.x/trunk/core
(includes = [lib/**, logs/**, docs/apidocs/**], excludes = [])
[INFO] 
[INFO] --- maven-antrun-plugin:1.6:run (save-version) @ hama-core ---
[INFO] Executing tasks

main:
    [mkdir] Created dir: /x1/jenkins/jenkins-slave/workspace/Hama-Nightly-for-Hadoop-2.x/trunk/core/target/generated-sources/java
[INFO] Executed tasks
[INFO] 
[INFO] --- build-helper-maven-plugin:1.8:add-source (add-source) @ hama-core ---
[INFO] Source directory: /x1/jenkins/jenkins-slave/workspace/Hama-Nightly-for-Hadoop-2.x/trunk/core/target/generated-sources/annotations
added.
[INFO] 
[INFO] --- maven-remote-resources-plugin:1.1:process (default) @ hama-core ---
[INFO] 
[INFO] --- maven-resources-plugin:2.4:resources (default-resources) @ hama-core ---
[INFO] Using 'UTF-8' encoding to copy filtered resources.
[INFO] Copying 6 resources
[INFO] Copying 3 resources
[INFO] 
[INFO] --- maven-compiler-plugin:2.3.2:compile (default-compile) @ hama-core ---
[INFO] Compiling 241 source files to /x1/jenkins/jenkins-slave/workspace/Hama-Nightly-for-Hadoop-2.x/trunk/core/target/classes
[INFO] 
[INFO] --- maven-resources-plugin:2.4:testResources (default-testResources) @ hama-core ---
[INFO] Using 'UTF-8' encoding to copy filtered resources.
[INFO] Copying 2 resources
[INFO] Copying 3 resources
[INFO] 
[INFO] --- maven-compiler-plugin:2.3.2:testCompile (default-testCompile) @ hama-core ---
[INFO] Compiling 36 source files to /x1/jenkins/jenkins-slave/workspace/Hama-Nightly-for-Hadoop-2.x/trunk/core/target/test-classes
[INFO] 
[INFO] --- maven-surefire-plugin:2.6:test (default-test) @ hama-core ---
[INFO] Concurrency config is {threadCount=10, parallel=methods, configurableParallelComputerPresent=false}
[INFO] Surefire report directory: /x1/jenkins/jenkins-slave/workspace/Hama-Nightly-for-Hadoop-2.x/trunk/core/target/surefire-reports

-------------------------------------------------------
 T E S T S
-------------------------------------------------------
Running org.apache.hama.util.TestZKUtil
log4j:WARN No appenders could be found for logger (org.apache.zookeeper.ZooKeeper).
log4j:WARN Please initialize the log4j system properly.
log4j:WARN See http://logging.apache.org/log4j/1.2/faq.html#noconfig for more info.
Tests run: 1, Failures: 0, Errors: 0, Skipped: 0, Time elapsed: 0.013 sec
Running org.apache.hama.bsp.TestBSPMasterGroomServer
log4j:WARN No appenders could be found for logger (org.apache.hadoop.metrics2.lib.MutableMetricsFactory).
log4j:WARN Please initialize the log4j system properly.
log4j:WARN See http://logging.apache.org/log4j/1.2/faq.html#noconfig for more info.
log4j:WARN No appenders could be found for logger (org.apache.hama.bsp.GroomServer).
log4j:WARN Please initialize the log4j system properly.
log4j:WARN See http://logging.apache.org/log4j/1.2/faq.html#noconfig for more info.

log4j:WARN No appenders could be found for logger (org.apache.hama.bsp.GroomServer).
log4j:WARN Please initialize the log4j system properly.
log4j:WARN See http://logging.apache.org/log4j/1.2/faq.html#noconfig for more info.

Tests run: 1, Failures: 0, Errors: 0, Skipped: 0, Time elapsed: 0.01 sec
Running org.apache.hama.bsp.message.TestDiskQueue
log4j:WARN No appenders could be found for logger (org.apache.hadoop.metrics2.lib.MutableMetricsFactory).
log4j:WARN Please initialize the log4j system properly.
log4j:WARN See http://logging.apache.org/log4j/1.2/faq.html#noconfig for more info.
Tests run: 2, Failures: 0, Errors: 0, Skipped: 0, Time elapsed: 0.008 sec
Running org.apache.hama.bsp.TestBSPMessageBundle
Tests run: 3, Failures: 0, Errors: 0, Skipped: 0, Time elapsed: 0.008 sec
Running org.apache.hama.bsp.message.compress.TestBSPMessageCompressor
Tests run: 1, Failures: 0, Errors: 0, Skipped: 0, Time elapsed: 0.007 sec
Running org.apache.hama.util.TestNumeric
Tests run: 1, Failures: 0, Errors: 0, Skipped: 0, Time elapsed: 0.017 sec
Running org.apache.hama.bsp.TestClusterStatus
Tests run: 1, Failures: 0, Errors: 0, Skipped: 0, Time elapsed: 0.008 sec
Running org.apache.hama.monitor.TestFederator
log4j:WARN No appenders could be found for logger (org.apache.hama.monitor.TestFederator).
log4j:WARN Please initialize the log4j system properly.
log4j:WARN See http://logging.apache.org/log4j/1.2/faq.html#noconfig for more info.
Tests run: 1, Failures: 0, Errors: 0, Skipped: 0, Time elapsed: 0.014 sec
Running org.apache.hama.ipc.TestIPC
log4j:WARN No appenders could be found for logger (org.apache.hadoop.metrics2.lib.MutableMetricsFactory).
log4j:WARN Please initialize the log4j system properly.
log4j:WARN See http://logging.apache.org/log4j/1.2/faq.html#noconfig for more info.
Tests run: 3, Failures: 0, Errors: 0, Skipped: 0, Time elapsed: 0.014 sec
Running org.apache.hama.ipc.TestRPC
log4j:WARN No appenders could be found for logger (org.apache.hadoop.metrics2.lib.MutableMetricsFactory).
log4j:WARN Please initialize the log4j system properly.
log4j:WARN See http://logging.apache.org/log4j/1.2/faq.html#noconfig for more info.
Tests run: 1, Failures: 0, Errors: 0, Skipped: 0, Time elapsed: 0.007 sec
Running org.apache.hama.bsp.TestFileInputFormat
log4j:WARN No appenders could be found for logger (org.apache.hama.bsp.BSPJobClient).
log4j:WARN Please initialize the log4j system properly.
log4j:WARN See http://logging.apache.org/log4j/1.2/faq.html#noconfig for more info.
hdfs://hadoop.uta.edu/user/hadoop/employee.txt,hdfs://hadoop.uta.edu/user/hadoop/department.txt
hdfs://hadoop.uta.edu/user/hadoop/employee.txt
hdfs://hadoop.uta.edu/user/hadoop/department.txt
Tests run: 2, Failures: 0, Errors: 0, Skipped: 0, Time elapsed: 0.008 sec
Running org.apache.hama.util.TestRandomVariable
Tests run: 3, Failures: 0, Errors: 0, Skipped: 0, Time elapsed: 0.009 sec
Running org.apache.hama.bsp.TestKeyValueTextInputFormat
log4j:WARN No appenders could be found for logger (org.apache.hadoop.metrics2.lib.MutableMetricsFactory).
log4j:WARN Please initialize the log4j system properly.
log4j:WARN See http://logging.apache.org/log4j/1.2/faq.html#noconfig for more info.
Tests run: 1, Failures: 0, Errors: 0, Skipped: 0, Time elapsed: 0.009 sec
Running org.apache.hama.util.TestBytes
AAA
CCC
EEE
AAA
BBB
CCC
DDD
http://A
http://]
http://z
Tests run: 8, Failures: 0, Errors: 0, Skipped: 0, Time elapsed: 0.009 sec
Running org.apache.hama.bsp.TestBSPTaskFaults
log4j:WARN No appenders could be found for logger (org.apache.hadoop.metrics2.lib.MutableMetricsFactory).
log4j:WARN Please initialize the log4j system properly.
log4j:WARN See http://logging.apache.org/log4j/1.2/faq.html#noconfig for more info.
Tests run: 5, Failures: 0, Errors: 1, Skipped: 0, Time elapsed: 0.019 sec <<< FAILURE!
Running org.apache.hama.bsp.message.TestMessageBundle
Tests run: 3, Failures: 0, Errors: 0, Skipped: 0, Time elapsed: 0.008 sec
Running org.apache.hama.bsp.sync.TestSyncServiceFactory
log4j:WARN No appenders could be found for logger (org.apache.zookeeper.server.quorum.QuorumPeerConfig).
log4j:WARN Please initialize the log4j system properly.
log4j:WARN See http://logging.apache.org/log4j/1.2/faq.html#noconfig for more info.
Tests run: 3, Failures: 0, Errors: 0, Skipped: 0, Time elapsed: 0.013 sec
Running org.apache.hama.bsp.message.compress.TestBSPCompressBundle
Tests run: 1, Failures: 0, Errors: 0, Skipped: 0, Time elapsed: 0.008 sec
Running org.apache.hama.bsp.TestPartitioning
log4j:WARN No appenders could be found for logger (org.apache.hadoop.metrics2.lib.MutableMetricsFactory).
log4j:WARN Please initialize the log4j system properly.
log4j:WARN See http://logging.apache.org/log4j/1.2/faq.html#noconfig for more info.
Tests run: 1, Failures: 0, Errors: 0, Skipped: 0, Time elapsed: 0.022 sec
Running org.apache.hama.bsp.TestCheckpoint
log4j:WARN No appenders could be found for logger (org.apache.hadoop.metrics2.lib.MutableMetricsFactory).
log4j:WARN Please initialize the log4j system properly.
log4j:WARN See http://logging.apache.org/log4j/1.2/faq.html#noconfig for more info.
Tests run: 3, Failures: 0, Errors: 0, Skipped: 0, Time elapsed: 0.011 sec
Running org.apache.hama.bsp.TestMessages
Tests run: 1, Failures: 0, Errors: 0, Skipped: 0, Time elapsed: 0.014 sec
Running org.apache.hama.bsp.message.TestHadoopMessageManager
log4j:WARN No appenders could be found for logger (org.apache.hadoop.metrics2.lib.MutableMetricsFactory).
log4j:WARN Please initialize the log4j system properly.
log4j:WARN See http://logging.apache.org/log4j/1.2/faq.html#noconfig for more info.
Tests run: 2, Failures: 0, Errors: 0, Skipped: 0, Time elapsed: 0.067 sec
Running org.apache.hama.bsp.TestTaskAllocation
Tests run: 1, Failures: 0, Errors: 0, Skipped: 0, Time elapsed: 0.012 sec
Running org.apache.hama.monitor.fd.TestFD
Running org.apache.hama.bsp.message.TestMessageIO
log4j:WARN No appenders could be found for logger (org.apache.hama.bsp.message.io.SpillingDataOutputBuffer).
log4j:WARN Please initialize the log4j system properly.
log4j:WARN See http://logging.apache.org/log4j/1.2/faq.html#noconfig for more info.
Tests run: 10, Failures: 0, Errors: 0, Skipped: 0, Time elapsed: 0.024 sec
Running org.apache.hama.monitor.TestConfigurator
log4j:WARN No appenders could be found for logger (org.apache.hama.monitor.TestConfigurator).
log4j:WARN Please initialize the log4j system properly.
log4j:WARN See http://logging.apache.org/log4j/1.2/faq.html#noconfig for more info.
Tests run: 1, Failures: 0, Errors: 0, Skipped: 0, Time elapsed: 0.025 sec
Running org.apache.hama.bsp.TestLocalRunner
log4j:WARN No appenders could be found for logger (org.apache.hama.bsp.BSPJobClient).
log4j:WARN Please initialize the log4j system properly.
log4j:WARN See http://logging.apache.org/log4j/1.2/faq.html#noconfig for more info.
Tests run: 1, Failures: 0, Errors: 0, Skipped: 0, Time elapsed: 0.01 sec
Running org.apache.hama.bsp.message.TestSpillingQueue
log4j:WARN No appenders could be found for logger (org.apache.hama.bsp.message.io.SpillingDataOutputBuffer).
log4j:WARN Please initialize the log4j system properly.
log4j:WARN See http://logging.apache.org/log4j/1.2/faq.html#noconfig for more info.
Tests run: 2, Failures: 0, Errors: 0, Skipped: 0, Time elapsed: 0.011 sec
Running org.apache.hama.bsp.TestZooKeeper
log4j:WARN No appenders could be found for logger (org.apache.zookeeper.server.quorum.QuorumPeerConfig).
log4j:WARN Please initialize the log4j system properly.
log4j:WARN See http://logging.apache.org/log4j/1.2/faq.html#noconfig for more info.
Tests run: 1, Failures: 0, Errors: 0, Skipped: 0, Time elapsed: 0.007 sec
Running org.apache.hama.zookeeper.TestZKTools
Tests run: 1, Failures: 0, Errors: 0, Skipped: 0, Time elapsed: 0.013 sec

Results :

Tests in error: 

Tests run: 65, Failures: 0, Errors: 1, Skipped: 0

[INFO] ------------------------------------------------------------------------
[INFO] Reactor Summary:
[INFO] 
[INFO] Apache Hama parent POM ............................ SUCCESS [4.485s]
[INFO] pipes ............................................. SUCCESS [6.833s]
[INFO] core .............................................. FAILURE [2:23.758s]
[INFO] graph ............................................. SKIPPED
[INFO] machine learning .................................. SKIPPED
[INFO] examples .......................................... SKIPPED
[INFO] hama-dist ......................................... SKIPPED
[INFO] yarn .............................................. SKIPPED
[INFO] ------------------------------------------------------------------------
[INFO] BUILD FAILURE
[INFO] ------------------------------------------------------------------------
[INFO] Total time: 2:35.513s
[INFO] Finished at: Sat Sep 07 23:03:49 UTC 2013
[INFO] Final Memory: 41M/491M
[INFO] ------------------------------------------------------------------------
[ERROR] Failed to execute goal org.apache.maven.plugins:maven-surefire-plugin:2.6:test (default-test)
on project hama-core: There are test failures.
[ERROR] 
[ERROR] Please refer to /x1/jenkins/jenkins-slave/workspace/Hama-Nightly-for-Hadoop-2.x/trunk/core/target/surefire-reports
for the individual test results.
[ERROR] -> [Help 1]
[ERROR] 
[ERROR] To see the full stack trace of the errors, re-run Maven with the -e switch.
[ERROR] Re-run Maven using the -X switch to enable full debug logging.
[ERROR] 
[ERROR] For more information about the errors and possible solutions, please read the following
articles:
[ERROR] [Help 1] http://cwiki.apache.org/confluence/display/MAVEN/MojoFailureException
[ERROR] 
[ERROR] After correcting the problems, you can resume the build with the command
[ERROR]   mvn <goals> -rf :hama-core
Build step 'Invoke top-level Maven targets' marked build as failure
Archiving artifacts
Recording test results

Mime
View raw message