hama-dev mailing list archives

Site index · List index
Message view « Date » · « Thread »
Top « Date » · « Thread »
From Apache Jenkins Server <jenk...@builds.apache.org>
Subject Build failed in Jenkins: Hama-Nightly-for-Hadoop-2.x #33
Date Mon, 16 Sep 2013 23:01:10 GMT
See <https://builds.apache.org/job/Hama-Nightly-for-Hadoop-2.x/33/>

------------------------------------------
[...truncated 634 lines...]
A         examples/src/main/java/org/apache/hama/examples/BipartiteMatching.java
A         examples/src/main/java/org/apache/hama/examples/PiEstimator.java
A         examples/src/main/java/org/apache/hama/examples/DynamicGraph.java
A         examples/src/main/java/org/apache/hama/examples/SemiClusterJobDriver.java
A         examples/src/main/java/org/apache/hama/examples/ExampleDriver.java
AU        examples/src/main/java/org/apache/hama/examples/SuperstepPiEstimator.java
A         examples/src/main/java/org/apache/hama/examples/Kmeans.java
A         examples/pom.xml
A         conf
A         conf/log4j.properties
A         conf/groomservers
A         conf/hama-env.sh
A         conf/hama-default.xml
A         conf/hama-site.xml
AU        CHANGES.txt
A         src
A         src/site
A         src/site/resources
A         src/site/resources/files
A         src/site/resources/files/hama-eclipse-formatter.xml
A         src/site/resources/images
AU        src/site/resources/images/headerlogo.png
A         src/site/resources/images/favicon.ico
AU        src/site/resources/images/hama_paint_logo_120x120.png
AU        src/site/resources/images/hama_art_arthur_300x220.png
AU        src/site/resources/images/hama_art_arthur.png
AU        src/site/resources/images/hama_paint_logo.png
AU        src/site/resources/images/apache-hama-white.png
AU        src/site/resources/images/headerlogo.xcf
AU        src/site/resources/images/hama_kim.png
AU        src/site/resources/images/hama_logo.png
A         src/site/resources/css
A         src/site/resources/css/site.css
A         src/site/xdoc
A         src/site/xdoc/index.xml
A         src/site/xdoc/developers.xml
AU        src/site/xdoc/getting_started_with_hama.xml
A         src/site/xdoc/issue-tracking.xml
A         src/site/xdoc/artwork.xml
A         src/site/xdoc/downloads.xml
AU        src/site/xdoc/hama_graph_tutorial.xml
AU        src/site/xdoc/hama_on_clouds.xml
A         src/site/xdoc/privacy_policy.xml
AU        src/site/xdoc/hama_bsp_tutorial.xml
A         src/site/xdoc/mail-lists.xml
A         src/site/xdoc/team-list.xml
A         src/site/xdoc/run_examples.xml
A         src/site/xdoc/irc-channel.xml
A         src/site/site.xml
A         src/assemble
A         src/assemble/src.xml
A         src/assemble/bin.xml
 U        .
At revision 1523829
no change for http://svn.apache.org/repos/asf/hama/trunk since the previous build
[Hama-Nightly-for-Hadoop-2.x] $ /bin/bash -xe /tmp/hudson8207728746237956677.sh
+ echo /home/hudson/tools/java/latest1.7/bin:/usr/local/sbin:/usr/local/bin:/usr/sbin:/usr/bin:/sbin:/bin:/usr/bin/X11:/usr/games:/usr/ucb:/usr/sfw/bin:/usr/ccs/bin:/usr/ucb:/usr/sfw/bin:/usr/ccs/bin:/usr/ucb:/usr/sfw/bin:/usr/ccs/bin:/usr/ucb:/usr/sfw/bin:/usr/ccs/bin
/home/hudson/tools/java/latest1.7/bin:/usr/local/sbin:/usr/local/bin:/usr/sbin:/usr/bin:/sbin:/bin:/usr/bin/X11:/usr/games:/usr/ucb:/usr/sfw/bin:/usr/ccs/bin:/usr/ucb:/usr/sfw/bin:/usr/ccs/bin:/usr/ucb:/usr/sfw/bin:/usr/ccs/bin:/usr/ucb:/usr/sfw/bin:/usr/ccs/bin
+ whoami
jenkins
+ ulimit -a
core file size          (blocks, -c) 0
data seg size           (kbytes, -d) unlimited
scheduling priority             (-e) 0
file size               (blocks, -f) unlimited
pending signals                 (-i) 192652
max locked memory       (kbytes, -l) 64
max memory size         (kbytes, -m) unlimited
open files                      (-n) 40000
pipe size            (512 bytes, -p) 8
POSIX message queues     (bytes, -q) 819200
real-time priority              (-r) 0
stack size              (kbytes, -s) 8192
cpu time               (seconds, -t) unlimited
max user processes              (-u) 192652
virtual memory          (kbytes, -v) unlimited
file locks                      (-x) unlimited
[trunk] $ /home/hudson/tools/maven/apache-maven-3.0.4/bin/mvn -Dmaven.repo.local=<https://builds.apache.org/job/Hama-Nightly-for-Hadoop-2.x/ws/.repository>
clean install -Phadoop2 -Dhadoop.version=2.0.3-alpha
[INFO] Scanning for projects...
Downloading: http://repo.maven.apache.org/maven2/org/apache/apache/8/apache-8.pom
4/14 KB   
8/14 KB   
12/14 KB   
14/14 KB   
           
Downloaded: http://repo.maven.apache.org/maven2/org/apache/apache/8/apache-8.pom (14 KB at
25.3 KB/sec)
Downloading: http://repo.maven.apache.org/maven2/org/apache/maven/wagon/wagon-ssh-external/1.0-beta-6/wagon-ssh-external-1.0-beta-6.pom
3/3 KB     
         
Downloaded: http://repo.maven.apache.org/maven2/org/apache/maven/wagon/wagon-ssh-external/1.0-beta-6/wagon-ssh-external-1.0-beta-6.pom
(3 KB at 43.3 KB/sec)
Downloading: http://repo.maven.apache.org/maven2/org/apache/maven/wagon/wagon-providers/1.0-beta-6/wagon-providers-1.0-beta-6.pom
3/3 KB   
         
Downloaded: http://repo.maven.apache.org/maven2/org/apache/maven/wagon/wagon-providers/1.0-beta-6/wagon-providers-1.0-beta-6.pom
(3 KB at 36.1 KB/sec)
Downloading: http://repo.maven.apache.org/maven2/org/apache/maven/wagon/wagon/1.0-beta-6/wagon-1.0-beta-6.pom
4/13 KB   
8/13 KB   
12/13 KB   
13/13 KB   
           
Downloaded: http://repo.maven.apache.org/maven2/org/apache/maven/wagon/wagon/1.0-beta-6/wagon-1.0-beta-6.pom
(13 KB at 205.0 KB/sec)
Downloading: http://repo.maven.apache.org/maven2/org/apache/maven/maven-parent/11/maven-parent-11.pom
4/32 KB    
8/32 KB   
12/32 KB   
16/32 KB   
17/32 KB   
21/32 KB   
25/32 KB   
27/32 KB   
31/32 KB   
32/32 KB   
           
Downloaded: http://repo.maven.apache.org/maven2/org/apache/maven/maven-parent/11/maven-parent-11.pom
(32 KB at 376.8 KB/sec)
Downloading: http://repo.maven.apache.org/maven2/org/apache/apache/5/apache-5.pom
4/5 KB     
5/5 KB   
         
Downloaded: http://repo.maven.apache.org/maven2/org/apache/apache/5/apache-5.pom (5 KB at
69.0 KB/sec)
Downloading: http://repo.maven.apache.org/maven2/org/codehaus/plexus/plexus-utils/1.4.2/plexus-utils-1.4.2.pom
2/2 KB   
         
Downloaded: http://repo.maven.apache.org/maven2/org/codehaus/plexus/plexus-utils/1.4.2/plexus-utils-1.4.2.pom
(2 KB at 33.6 KB/sec)
Downloading: http://repo.maven.apache.org/maven2/org/codehaus/plexus/plexus/1.0.11/plexus-1.0.11.pom
4/9 KB   
8/9 KB   
9/9 KB   
         
Downloaded: http://repo.maven.apache.org/maven2/org/codehaus/plexus/plexus/1.0.11/plexus-1.0.11.pom
(9 KB at 151.0 KB/sec)
Downloading: http://repo.maven.apache.org/maven2/org/apache/maven/wagon/wagon-ssh-common/1.0-beta-6/wagon-ssh-common-1.0-beta-6.pom
2/2 KB   
         
Downloaded: http://repo.maven.apache.org/maven2/org/apache/maven/wagon/wagon-ssh-common/1.0-beta-6/wagon-ssh-common-1.0-beta-6.pom
(2 KB at 31.2 KB/sec)
Downloading: http://repo.maven.apache.org/maven2/org/codehaus/plexus/plexus-interactivity-api/1.0-alpha-6/plexus-interactivity-api-1.0-alpha-6.pom
726/726 B   
            
Downloaded: http://repo.maven.apache.org/maven2/org/codehaus/plexus/plexus-interactivity-api/1.0-alpha-6/plexus-interactivity-api-1.0-alpha-6.pom
(726 B at 12.4 KB/sec)
Downloading: http://repo.maven.apache.org/maven2/org/codehaus/plexus/plexus-interactivity/1.0-alpha-6/plexus-interactivity-1.0-alpha-6.pom
2/2 KB      
         
Downloaded: http://repo.maven.apache.org/maven2/org/codehaus/plexus/plexus-interactivity/1.0-alpha-6/plexus-interactivity-1.0-alpha-6.pom
(2 KB at 16.4 KB/sec)
Downloading: http://repo.maven.apache.org/maven2/org/codehaus/plexus/plexus-components/1.1.9/plexus-components-1.1.9.pom
3/3 KB   
         
Downloaded: http://repo.maven.apache.org/maven2/org/codehaus/plexus/plexus-components/1.1.9/plexus-components-1.1.9.pom
(3 KB at 41.6 KB/sec)
Downloading: http://repo.maven.apache.org/maven2/org/codehaus/plexus/plexus/1.0.10/plexus-1.0.10.pom
4/9 KB   
8/9 KB   
9/9 KB   
         
Downloaded: http://repo.maven.apache.org/maven2/org/codehaus/plexus/plexus/1.0.10/plexus-1.0.10.pom
(9 KB at 141.3 KB/sec)
Downloading: http://repo.maven.apache.org/maven2/org/apache/maven/wagon/wagon-provider-api/1.0-beta-6/wagon-provider-api-1.0-beta-6.pom
2/2 KB   
         
Downloaded: http://repo.maven.apache.org/maven2/org/apache/maven/wagon/wagon-provider-api/1.0-beta-6/wagon-provider-api-1.0-beta-6.pom
(2 KB at 30.7 KB/sec)
Downloading: http://repo.maven.apache.org/maven2/org/apache/maven/wagon/wagon-ssh-external/1.0-beta-6/wagon-ssh-external-1.0-beta-6.jar
Downloading: http://repo.maven.apache.org/maven2/org/codehaus/plexus/plexus-utils/1.4.2/plexus-utils-1.4.2.jar
Downloading: http://repo.maven.apache.org/maven2/org/apache/maven/wagon/wagon-ssh-common/1.0-beta-6/wagon-ssh-common-1.0-beta-6.jar
Downloading: http://repo.maven.apache.org/maven2/org/codehaus/plexus/plexus-interactivity-api/1.0-alpha-6/plexus-interactivity-api-1.0-alpha-6.jar
4/15 KB   
8/15 KB   
12/15 KB   
15/15 KB   
15/15 KB   4/186 KB   
15/15 KB   4/12 KB   4/186 KB   
15/15 KB   4/12 KB   6/186 KB   
15/15 KB   8/12 KB   10/186 KB   
15/15 KB   8/12 KB   10/186 KB   
15/15 KB   12/12 KB   10/186 KB   
15/15 KB   12/12 KB   14/186 KB   
15/15 KB   12/12 KB   14/186 KB   
15/15 KB   12/12 KB   2/26 KB   14/186 KB   
                                            
Downloaded: http://repo.maven.apache.org/maven2/org/apache/maven/wagon/wagon-ssh-external/1.0-beta-6/wagon-ssh-external-1.0-beta-6.jar
(15 KB at 239.6 KB/sec)
12/12 KB   6/26 KB   14/186 KB              
12/12 KB   10/26 KB   14/186 KB   
12/12 KB   14/26 KB   14/186 KB   
12/12 KB   14/26 KB   14/186 KB   
12/12 KB   14/26 KB   18/186 KB   
12/12 KB   14/26 KB   22/186 KB   
12/12 KB   14/26 KB   26/186 KB   
12/12 KB   14/26 KB   30/186 KB   
12/12 KB   14/26 KB   33/186 KB   
12/12 KB   18/26 KB   33/186 KB   
12/12 KB   22/26 KB   33/186 KB   
12/12 KB   26/26 KB   33/186 KB   
                                  
26/26 KB   33/186 KB              
Downloaded: http://repo.maven.apache.org/maven2/org/codehaus/plexus/plexus-interactivity-api/1.0-alpha-6/plexus-interactivity-api-1.0-alpha-6.jar
(12 KB at 135.5 KB/sec)
26/26 KB   34/186 KB   
26/26 KB   38/186 KB   
26/26 KB   42/186 KB   
26/26 KB   46/186 KB   
26/26 KB   50/186 KB   
26/26 KB   54/186 KB   
26/26 KB   57/186 KB   
                       
Downloaded: http://repo.maven.apache.org/maven2/org/apache/maven/wagon/wagon-ssh-common/1.0-beta-6/wagon-ssh-common-1.0-beta-6.jar
(26 KB at 225.9 KB/sec)
61/186 KB              
65/186 KB   
69/186 KB   
73/186 KB   
77/186 KB   
81/186 KB   
84/186 KB   
85/186 KB   
89/186 KB   
93/186 KB   
97/186 KB   
101/186 KB   
105/186 KB   
109/186 KB   
113/186 KB   
115/186 KB   
118/186 KB   
122/186 KB   
126/186 KB   
130/186 KB   
134/186 KB   
138/186 KB   
142/186 KB   
146/186 KB   
149/186 KB   
153/186 KB   
157/186 KB   
161/186 KB   
165/186 KB   
169/186 KB   
173/186 KB   
177/186 KB   
181/186 KB   
185/186 KB   
186/186 KB   
             
Downloaded: http://repo.maven.apache.org/maven2/org/codehaus/plexus/plexus-utils/1.4.2/plexus-utils-1.4.2.jar
(186 KB at 764.9 KB/sec)
[ERROR] The build could not read 1 project -> [Help 1]
[ERROR]   
[ERROR]   The project org.apache.hama:hama-yarn:0.6.3-SNAPSHOT (/x1/jenkins/jenkins-slave/workspace/Hama-Nightly-for-Hadoop-2.x/trunk/yarn/pom.xml)
has 1 error
[ERROR]     Non-resolvable parent POM: Could not find artifact org.apache.hama:hama-parent:pom:0.6.3-SNAPSHOT
and 'parent.relativePath' points at wrong local POM @ line 19, column 11 -> [Help 2]
[ERROR] 
[ERROR] To see the full stack trace of the errors, re-run Maven with the -e switch.
[ERROR] Re-run Maven using the -X switch to enable full debug logging.
[ERROR] 
[ERROR] For more information about the errors and possible solutions, please read the following
articles:
[ERROR] [Help 1] http://cwiki.apache.org/confluence/display/MAVEN/ProjectBuildingException
[ERROR] [Help 2] http://cwiki.apache.org/confluence/display/MAVEN/UnresolvableModelException
Build step 'Invoke top-level Maven targets' marked build as failure
Archiving artifacts
Recording test results

Mime
View raw message