hama-dev mailing list archives

Site index · List index
Message view « Date » · « Thread »
Top « Date » · « Thread »
From Apache Jenkins Server <jenk...@builds.apache.org>
Subject Build failed in Jenkins: Hama-Nightly-for-Hadoop-2.x #2
Date Fri, 16 Aug 2013 23:08:17 GMT
See <https://builds.apache.org/job/Hama-Nightly-for-Hadoop-2.x/2/changes>

Changes:

[yxjiang] HAMA-796: Add Vector multiply Matrix for DoubleVector as well as DenseDoubleVector

[edwardyoon] HAMA-767: Add vertex addition/removal APIs (Anastasis Andronidis via edwardyoon)

------------------------------------------
[...truncated 73347 lines...]
13/08/16 23:07:44 INFO ann.NeuralNetworkTrainer: Iteration [1997] begins...

13/08/16 23:07:44 INFO ann.NeuralNetworkTrainer: Task 1 has read 669095 records.

13/08/16 23:07:44 INFO ann.NeuralNetworkTrainer: Task 0 has read 667098 records.

13/08/16 23:07:44 INFO ann.NeuralNetworkTrainer: Task 2 has read 667098 records.

13/08/16 23:07:44 INFO ann.NeuralNetworkTrainer: Task 0 has read 667198 records.

13/08/16 23:07:44 INFO ann.NeuralNetworkTrainer: Task 1 has read 669195 records.

13/08/16 23:07:44 INFO ann.NeuralNetworkTrainer: Task 2 has read 667198 records.

13/08/16 23:07:44 INFO ann.NeuralNetworkTrainer: Task 2 has read 667298 records.

13/08/16 23:07:44 INFO ann.NeuralNetworkTrainer: Task 0 has read 667298 records.

13/08/16 23:07:44 INFO ann.NeuralNetworkTrainer: Task 1 has read 669295 records.

13/08/16 23:07:44 INFO ann.NeuralNetworkTrainer: Task 2 has read 667332 records.

13/08/16 23:07:44 INFO ann.NeuralNetworkTrainer: Task 0 has read 667332 records.

13/08/16 23:07:44 INFO ann.NeuralNetworkTrainer: Task 1 has read 669330 records.

13/08/16 23:07:44 INFO ann.NeuralNetworkTrainer: Iteration [1998] begins...

13/08/16 23:07:44 INFO ann.NeuralNetworkTrainer: Task 0 has read 667432 records.

13/08/16 23:07:44 INFO ann.NeuralNetworkTrainer: Task 1 has read 669430 records.

13/08/16 23:07:44 INFO ann.NeuralNetworkTrainer: Task 2 has read 667432 records.

13/08/16 23:07:44 INFO ann.NeuralNetworkTrainer: Task 2 has read 667532 records.

13/08/16 23:07:44 INFO ann.NeuralNetworkTrainer: Task 0 has read 667532 records.

13/08/16 23:07:44 INFO ann.NeuralNetworkTrainer: Task 1 has read 669530 records.

13/08/16 23:07:44 INFO ann.NeuralNetworkTrainer: Task 2 has read 667632 records.

13/08/16 23:07:44 INFO ann.NeuralNetworkTrainer: Task 0 has read 667632 records.

13/08/16 23:07:44 INFO ann.NeuralNetworkTrainer: Task 1 has read 669630 records.

13/08/16 23:07:44 INFO ann.NeuralNetworkTrainer: Task 2 has read 667666 records.

13/08/16 23:07:44 INFO ann.NeuralNetworkTrainer: Task 0 has read 667666 records.

13/08/16 23:07:44 INFO ann.NeuralNetworkTrainer: Task 1 has read 669665 records.

13/08/16 23:07:44 INFO ann.NeuralNetworkTrainer: Iteration [1999] begins...

13/08/16 23:07:44 INFO ann.NeuralNetworkTrainer: Task 1 has read 669765 records.

13/08/16 23:07:44 INFO ann.NeuralNetworkTrainer: Task 0 has read 667766 records.

13/08/16 23:07:44 INFO ann.NeuralNetworkTrainer: Task 2 has read 667766 records.

13/08/16 23:07:44 INFO ann.NeuralNetworkTrainer: Task 1 has read 669865 records.

13/08/16 23:07:44 INFO ann.NeuralNetworkTrainer: Task 0 has read 667866 records.

13/08/16 23:07:44 INFO ann.NeuralNetworkTrainer: Task 2 has read 667866 records.

13/08/16 23:07:44 INFO ann.NeuralNetworkTrainer: Task 1 has read 669965 records.

13/08/16 23:07:44 INFO ann.NeuralNetworkTrainer: Task 0 has read 667966 records.

13/08/16 23:07:44 INFO ann.NeuralNetworkTrainer: Task 2 has read 667966 records.

13/08/16 23:07:44 INFO ann.NeuralNetworkTrainer: Task 0 has read 668000 records.

13/08/16 23:07:44 INFO ann.NeuralNetworkTrainer: Task 1 has read 670000 records.

13/08/16 23:07:44 INFO ann.NeuralNetworkTrainer: Task 2 has read 668000 records.

13/08/16 23:07:44 INFO ann.NeuralNetworkTrainer: Task 2 finished.

13/08/16 23:07:44 INFO ann.NeuralNetworkTrainer: Task 0 finished.

13/08/16 23:07:44 INFO ann.NeuralNetworkTrainer: Task 1 finished.

13/08/16 23:07:44 INFO ann.NeuralNetworkTrainer: Task 2 totally read 668000 records.


13/08/16 23:07:44 INFO ann.NeuralNetworkTrainer: Task 0 totally read 668000 records.


13/08/16 23:07:44 INFO ann.NeuralNetworkTrainer: Task 1 totally read 670000 records.


13/08/16 23:07:44 INFO ann.NeuralNetworkTrainer: Master write learned model to /tmp/xorModel-training-by-xor.data


13/08/16 23:07:46 INFO bsp.BSPJobClient: Current supersteps number: 17999

13/08/16 23:07:46 INFO bsp.BSPJobClient: The total number of supersteps: 17999

13/08/16 23:07:46 INFO bsp.BSPJobClient: Counters: 8

13/08/16 23:07:46 INFO bsp.BSPJobClient:   org.apache.hama.bsp.JobInProgress$JobCounter

13/08/16 23:07:46 INFO bsp.BSPJobClient:     SUPERSTEPS=17999

13/08/16 23:07:46 INFO bsp.BSPJobClient:     LAUNCHED_TASKS=3

13/08/16 23:07:46 INFO bsp.BSPJobClient:   org.apache.hama.bsp.BSPPeerImpl$PeerCounter

13/08/16 23:07:46 INFO bsp.BSPJobClient:     SUPERSTEP_SUM=54000

13/08/16 23:07:46 INFO bsp.BSPJobClient:     IO_BYTES_READ=88840000

13/08/16 23:07:46 INFO bsp.BSPJobClient:     TIME_IN_SYNC_MS=5195

13/08/16 23:07:46 INFO bsp.BSPJobClient:     TOTAL_MESSAGES_SENT=48000

13/08/16 23:07:46 INFO bsp.BSPJobClient:     TASK_INPUT_RECORDS=2000000

13/08/16 23:07:46 INFO bsp.BSPJobClient:     TOTAL_MESSAGES_RECEIVED=48000

13/08/16 23:07:46 INFO mortbay.log: Reload model from /tmp/xorModel-training-by-xor.data.

Tests run: 7, Failures: 0, Errors: 0, Skipped: 0, Time elapsed: 1.14 sec
Running org.apache.hama.ml.regression.VectorDoubleFileInputFormatTest
13/08/16 23:07:47 INFO mortbay.log: Logging to org.slf4j.impl.Log4jLoggerAdapter(org.mortbay.log)
via org.mortbay.log.Slf4jLog

13/08/16 23:07:47 WARN util.NativeCodeLoader: Unable to load native-hadoop library for your
platform... using builtin-java classes where applicable

13/08/16 23:07:47 WARN snappy.LoadSnappy: Snappy native library not loaded

Tests run: 1, Failures: 0, Errors: 0, Skipped: 0, Time elapsed: 0.009 sec
Running org.apache.hama.ml.perception.TestSmallMLPMessage
13/08/16 23:07:48 WARN util.NativeCodeLoader: Unable to load native-hadoop library for your
platform... using builtin-java classes where applicable

Tests run: 2, Failures: 0, Errors: 0, Skipped: 0, Time elapsed: 0.014 sec
Running org.apache.hama.ml.math.TestDenseDoubleMatrix
Tests run: 14, Failures: 0, Errors: 0, Skipped: 0, Time elapsed: 0.015 sec
Running org.apache.hama.ml.regression.TestLogisticRegression
13/08/16 23:07:53 INFO mortbay.log: Logging to org.slf4j.impl.Log4jLoggerAdapter(org.mortbay.log)
via org.mortbay.log.Slf4jLog

13/08/16 23:07:53 INFO mortbay.log: Relative error: 21.000000%


Tests run: 1, Failures: 0, Errors: 0, Skipped: 0, Time elapsed: 0.009 sec
Running org.apache.hama.ml.regression.LinearRegressionModelTest
Tests run: 2, Failures: 0, Errors: 0, Skipped: 0, Time elapsed: 0.013 sec
Running org.apache.hama.ml.kmeans.TestKMeansBSP
13/08/16 23:07:54 WARN util.NativeCodeLoader: Unable to load native-hadoop library for your
platform... using builtin-java classes where applicable

13/08/16 23:07:54 INFO mortbay.log: Logging to org.slf4j.impl.Log4jLoggerAdapter(org.mortbay.log)
via org.mortbay.log.Slf4jLog

13/08/16 23:07:54 INFO bsp.FileInputFormat: Total input paths to process : 1

13/08/16 23:07:54 WARN bsp.BSPJobClient: No job jar file set.  User classes may not be found.
See BSPJob#setJar(String) or check Your jar file.

13/08/16 23:07:54 INFO bsp.BSPJobClient: Running job: job_localrunner_0001

13/08/16 23:07:54 INFO bsp.LocalBSPRunner: Setting up a new barrier for 1 tasks!

13/08/16 23:07:54 INFO kmeans.KMeansBSP: Finished! Writing the assignments...

13/08/16 23:07:54 INFO kmeans.KMeansBSP: Done.

13/08/16 23:07:57 INFO bsp.BSPJobClient: Current supersteps number: 1

13/08/16 23:07:57 INFO bsp.BSPJobClient: The total number of supersteps: 1

13/08/16 23:07:57 INFO bsp.BSPJobClient: Counters: 9

13/08/16 23:07:57 INFO bsp.BSPJobClient:   org.apache.hama.bsp.JobInProgress$JobCounter

13/08/16 23:07:57 INFO bsp.BSPJobClient:     SUPERSTEPS=1

13/08/16 23:07:57 INFO bsp.BSPJobClient:     LAUNCHED_TASKS=1

13/08/16 23:07:57 INFO bsp.BSPJobClient:   org.apache.hama.bsp.BSPPeerImpl$PeerCounter

13/08/16 23:07:57 INFO bsp.BSPJobClient:     SUPERSTEP_SUM=2

13/08/16 23:07:57 INFO bsp.BSPJobClient:     IO_BYTES_READ=8460

13/08/16 23:07:57 INFO bsp.BSPJobClient:     TIME_IN_SYNC_MS=0

13/08/16 23:07:57 INFO bsp.BSPJobClient:     TOTAL_MESSAGES_SENT=2

13/08/16 23:07:57 INFO bsp.BSPJobClient:     TASK_INPUT_RECORDS=300

13/08/16 23:07:57 INFO bsp.BSPJobClient:     TOTAL_MESSAGES_RECEIVED=2

13/08/16 23:07:57 INFO bsp.BSPJobClient:     TASK_OUTPUT_RECORDS=100

{0=[50.0, 50.0]}
Tests run: 1, Failures: 0, Errors: 0, Skipped: 0, Time elapsed: 0.009 sec
Running org.apache.hama.ml.regression.TestLinearRegression
13/08/16 23:07:58 INFO mortbay.log: Logging to org.slf4j.impl.Log4jLoggerAdapter(org.mortbay.log)
via org.mortbay.log.Slf4jLog

13/08/16 23:07:58 INFO mortbay.log: Relative error 0.078581%


13/08/16 23:07:59 INFO mortbay.log: Relative error: 6.302337%


Tests run: 2, Failures: 0, Errors: 0, Skipped: 0, Time elapsed: 0.009 sec
Running org.apache.hama.ml.regression.LogisticRegressionModelTest
Tests run: 2, Failures: 0, Errors: 0, Skipped: 0, Time elapsed: 0.009 sec

Results :

Failed tests: 

Tests run: 59, Failures: 1, Errors: 0, Skipped: 0

[INFO] ------------------------------------------------------------------------
[INFO] Reactor Summary:
[INFO] 
[INFO] Apache Hama parent POM ............................ SUCCESS [10.919s]
[INFO] core .............................................. SUCCESS [2:20.571s]
[INFO] graph ............................................. SUCCESS [28.297s]
[INFO] machine learning .................................. FAILURE [51.030s]
[INFO] examples .......................................... SKIPPED
[INFO] hama-dist ......................................... SKIPPED
[INFO] yarn .............................................. SKIPPED
[INFO] ------------------------------------------------------------------------
[INFO] BUILD FAILURE
[INFO] ------------------------------------------------------------------------
[INFO] Total time: 3:52.451s
[INFO] Finished at: Fri Aug 16 23:07:59 UTC 2013
[INFO] Final Memory: 81M/532M
[INFO] ------------------------------------------------------------------------
[ERROR] Failed to execute goal org.apache.maven.plugins:maven-surefire-plugin:2.6:test (default-test)
on project hama-ml: There are test failures.
[ERROR] 
[ERROR] Please refer to <https://builds.apache.org/job/Hama-Nightly-for-Hadoop-2.x/ws/trunk/ml/target/surefire-reports>
for the individual test results.
[ERROR] -> [Help 1]
[ERROR] 
[ERROR] To see the full stack trace of the errors, re-run Maven with the -e switch.
[ERROR] Re-run Maven using the -X switch to enable full debug logging.
[ERROR] 
[ERROR] For more information about the errors and possible solutions, please read the following
articles:
[ERROR] [Help 1] http://cwiki.apache.org/confluence/display/MAVEN/MojoFailureException
[ERROR] 
[ERROR] After correcting the problems, you can resume the build with the command
[ERROR]   mvn <goals> -rf :hama-ml
Build step 'Invoke top-level Maven targets' marked build as failure
Archiving artifacts
Recording test results
Updating HAMA-767
Updating HAMA-796

Mime
View raw message