hama-dev mailing list archives

Site index · List index
Message view « Date » · « Thread »
Top « Date » · « Thread »
From Apache Jenkins Server <jenk...@builds.apache.org>
Subject Build failed in Jenkins: Hama-Nightly-for-Hadoop-1.x #1017
Date Tue, 27 Aug 2013 23:35:39 GMT
See <https://builds.apache.org/job/Hama-Nightly-for-Hadoop-1.x/1017/>

------------------------------------------
[...truncated 2560 lines...]
13/08/27 23:35:12 INFO ipc.Server: IPC Server handler 5 on 48489: exiting

13/08/27 23:35:12 INFO ipc.Server: IPC Server handler 3 on 48489: exiting

13/08/27 23:35:12 INFO ipc.Server: IPC Server handler 1 on 48489: exiting

13/08/27 23:35:12 INFO ipc.Server: IPC Server handler 8 on 48489: exiting

13/08/27 23:35:12 INFO ipc.Server: IPC Server handler 7 on 48489: exiting

13/08/27 23:35:12 INFO ipc.Server: IPC Server handler 4 on 48489: exiting

13/08/27 23:35:12 INFO server.PrepRequestProcessor: Shutting down

13/08/27 23:35:12 INFO server.SyncRequestProcessor: Shutting down

13/08/27 23:35:12 INFO server.PrepRequestProcessor: PrepRequestProcessor exited loop!

13/08/27 23:35:12 INFO server.SyncRequestProcessor: SyncRequestProcessor exited!

13/08/27 23:35:12 INFO server.FinalRequestProcessor: shutdown of request processor complete

Tests run: 1, Failures: 0, Errors: 0, Skipped: 0, Time elapsed: 0.017 sec
Running org.apache.hama.bsp.TestCheckpoint
13/08/27 23:35:13 INFO bsp.TestCheckpoint: Got port = 12502

13/08/27 23:35:14 INFO bsp.TestCheckpoint: Created bsp peer and other parameters

13/08/27 23:35:14 INFO bsp.TestCheckpoint: SyncClient Storing value step = 1 count = 0 for
key job_checkpttest_0001/checkpoint/1/

13/08/27 23:35:14 INFO ft.AsyncRcvdMsgCheckpointImpl: Enabled = true checkPointInterval =
1 lastCheckPointStep = 1 getSuperstepCount() = 1

13/08/27 23:35:14 INFO ft.AsyncRcvdMsgCheckpointImpl: checkpointNext = true checkpointMessageCount
= 0

13/08/27 23:35:14 INFO bsp.TestCheckpoint: After barrier 1

13/08/27 23:35:14 INFO bsp.TestCheckpoint: Completed first sync.

13/08/27 23:35:14 INFO bsp.TestCheckpoint: Getting value for key job_checkpttest_0001/checkpoint/1/

13/08/27 23:35:14 INFO ft.AsyncRcvdMsgCheckpointImpl: Creating path checkpoint/job_checkpttest_0001/2/1

13/08/27 23:35:14 WARN util.NativeCodeLoader: Unable to load native-hadoop library for your
platform... using builtin-java classes where applicable

13/08/27 23:35:14 INFO bsp.TestCheckpoint: SyncClient Storing value step = 2 count = 1 for
key job_checkpttest_0001/checkpoint/1/

13/08/27 23:35:14 INFO ft.AsyncRcvdMsgCheckpointImpl: Enabled = true checkPointInterval =
1 lastCheckPointStep = 2 getSuperstepCount() = 2

13/08/27 23:35:14 INFO ft.AsyncRcvdMsgCheckpointImpl: checkpointNext = true checkpointMessageCount
= 0

13/08/27 23:35:14 INFO bsp.TestCheckpoint: After barrier 2

13/08/27 23:35:14 INFO bsp.TestCheckpoint: Completed second sync.

13/08/27 23:35:14 INFO bsp.TestCheckpoint: Getting value for key job_checkpttest_0001/checkpoint/1/

13/08/27 23:35:14 INFO bsp.TestCheckpoint: Got port = 12502

13/08/27 23:35:14 INFO bsp.TestCheckpoint: SyncClient Storing value step = 3 count = 5 for
key job_checkpttest_0001/checkpoint/1/

13/08/27 23:35:14 INFO bsp.TestCheckpoint: Getting value for key job_checkpttest_0001/checkpoint/1/

13/08/27 23:35:14 INFO bsp.TestCheckpoint: Created bsp peer and other parameters

13/08/27 23:35:14 INFO bsp.TestCheckpoint: Got port = 12502

13/08/27 23:35:14 INFO bsp.TestCheckpoint: Getting value for key job_checkpttest_0001/checkpoint/1/

13/08/27 23:35:14 INFO bsp.TestCheckpoint: SyncClient Storing value step = 1 count = 0 for
key job_checkpttest_0001/checkpoint/1/

13/08/27 23:35:14 INFO ft.AsyncRcvdMsgCheckpointImpl: Enabled = true checkPointInterval =
2 lastCheckPointStep = 1 getSuperstepCount() = 1

13/08/27 23:35:14 INFO ft.AsyncRcvdMsgCheckpointImpl: checkpointNext = false checkpointMessageCount
= 0

13/08/27 23:35:14 INFO bsp.TestCheckpoint: After barrier 1

13/08/27 23:35:14 INFO bsp.TestCheckpoint: Getting value for key job_checkpttest_0001/checkpoint/1/

13/08/27 23:35:14 INFO ft.AsyncRcvdMsgCheckpointImpl: Enabled = true checkPointInterval =
2 lastCheckPointStep = 1 getSuperstepCount() = 2

13/08/27 23:35:14 INFO ft.AsyncRcvdMsgCheckpointImpl: checkpointNext = true checkpointMessageCount
= 0

13/08/27 23:35:14 INFO bsp.TestCheckpoint: After barrier 2

13/08/27 23:35:14 INFO bsp.TestCheckpoint: Getting value for key job_checkpttest_0001/checkpoint/1/

13/08/27 23:35:14 INFO ft.AsyncRcvdMsgCheckpointImpl: Creating path checkpoint/job_checkpttest_0001/3/1

13/08/27 23:35:14 INFO bsp.TestCheckpoint: SyncClient Storing value step = 3 count = 1 for
key job_checkpttest_0001/checkpoint/1/

13/08/27 23:35:14 INFO ft.AsyncRcvdMsgCheckpointImpl: Enabled = true checkPointInterval =
2 lastCheckPointStep = 3 getSuperstepCount() = 3

13/08/27 23:35:14 INFO ft.AsyncRcvdMsgCheckpointImpl: checkpointNext = false checkpointMessageCount
= 0

13/08/27 23:35:14 INFO bsp.TestCheckpoint: After barrier 3

13/08/27 23:35:14 INFO bsp.TestCheckpoint: Getting value for key job_checkpttest_0001/checkpoint/1/

13/08/27 23:35:14 INFO ft.AsyncRcvdMsgCheckpointImpl: Enabled = true checkPointInterval =
2 lastCheckPointStep = 3 getSuperstepCount() = 4

13/08/27 23:35:14 INFO ft.AsyncRcvdMsgCheckpointImpl: checkpointNext = true checkpointMessageCount
= 0

13/08/27 23:35:14 INFO bsp.TestCheckpoint: After barrier 4

13/08/27 23:35:14 INFO bsp.TestCheckpoint: Getting value for key job_checkpttest_0001/checkpoint/1/

13/08/27 23:35:14 INFO ft.AsyncRcvdMsgCheckpointImpl: Creating path checkpoint/job_checkpttest_0001/5/1

13/08/27 23:35:14 INFO bsp.TestCheckpoint: SyncClient Storing value step = 5 count = 2 for
key job_checkpttest_0001/checkpoint/1/

13/08/27 23:35:14 INFO ft.AsyncRcvdMsgCheckpointImpl: Enabled = true checkPointInterval =
2 lastCheckPointStep = 5 getSuperstepCount() = 5

13/08/27 23:35:14 INFO ft.AsyncRcvdMsgCheckpointImpl: checkpointNext = false checkpointMessageCount
= 0

13/08/27 23:35:14 INFO bsp.TestCheckpoint: After barrier 5

13/08/27 23:35:14 INFO bsp.TestCheckpoint: Getting value for key job_checkpttest_0001/checkpoint/1/

13/08/27 23:35:14 INFO ft.AsyncRcvdMsgCheckpointImpl: Enabled = true checkPointInterval =
2 lastCheckPointStep = 5 getSuperstepCount() = 6

13/08/27 23:35:14 INFO ft.AsyncRcvdMsgCheckpointImpl: checkpointNext = true checkpointMessageCount
= 0

13/08/27 23:35:14 INFO bsp.TestCheckpoint: After barrier 6

13/08/27 23:35:14 INFO bsp.TestCheckpoint: Getting value for key job_checkpttest_0001/checkpoint/1/

Tests run: 3, Failures: 0, Errors: 0, Skipped: 0, Time elapsed: 0.01 sec
Running org.apache.hama.bsp.TestMessages
Tests run: 1, Failures: 0, Errors: 0, Skipped: 0, Time elapsed: 0.01 sec
Running org.apache.hama.bsp.message.TestHadoopMessageManager
13/08/27 23:35:15 INFO ipc.Server: Starting Socket Reader #1 for port 14001

13/08/27 23:35:15 INFO ipc.Server: IPC Server Responder: starting

13/08/27 23:35:15 INFO ipc.Server: IPC Server listener on 14001: starting

13/08/27 23:35:15 INFO message.HadoopMessageManagerImpl:  BSPPeer address:janus.apache.org
port:14001

13/08/27 23:35:15 INFO ipc.Server: IPC Server handler 0 on 14001: starting

13/08/27 23:35:15 INFO ipc.Server: Stopping server on 14001

13/08/27 23:35:15 INFO ipc.Server: IPC Server handler 0 on 14001: exiting

13/08/27 23:35:15 INFO ipc.Server: Stopping IPC Server listener on 14001

13/08/27 23:35:15 INFO ipc.Server: Stopping IPC Server Responder

13/08/27 23:35:15 WARN util.NativeCodeLoader: Unable to load native-hadoop library for your
platform... using builtin-java classes where applicable

13/08/27 23:35:15 INFO ipc.Server: Starting Socket Reader #1 for port 14002

13/08/27 23:35:15 INFO ipc.Server: IPC Server Responder: starting

13/08/27 23:35:15 INFO ipc.Server: IPC Server listener on 14002: starting

13/08/27 23:35:15 INFO ipc.Server: IPC Server handler 0 on 14002: starting

13/08/27 23:35:15 INFO message.HadoopMessageManagerImpl:  BSPPeer address:janus.apache.org
port:14002

13/08/27 23:35:15 INFO ipc.Server: Stopping server on 14002

13/08/27 23:35:15 INFO ipc.Server: IPC Server handler 0 on 14002: exiting

13/08/27 23:35:15 INFO ipc.Server: Stopping IPC Server listener on 14002

13/08/27 23:35:15 INFO ipc.Server: Stopping IPC Server Responder

Tests run: 2, Failures: 0, Errors: 0, Skipped: 0, Time elapsed: 0.011 sec
Running org.apache.hama.bsp.TestTaskAllocation
Tests run: 1, Failures: 0, Errors: 0, Skipped: 0, Time elapsed: 0.01 sec
Running org.apache.hama.monitor.fd.TestFD
Running org.apache.hama.bsp.message.TestMessageIO
Tests run: 10, Failures: 0, Errors: 0, Skipped: 0, Time elapsed: 0.012 sec
Running org.apache.hama.monitor.TestConfigurator
13/08/27 23:35:17 INFO monitor.TestConfigurator: Plugins dir is not created, returned tasks
should be null -> null

Tests run: 1, Failures: 0, Errors: 0, Skipped: 0, Time elapsed: 0.011 sec
Running org.apache.hama.bsp.TestLocalRunner
13/08/27 23:35:18 WARN util.NativeCodeLoader: Unable to load native-hadoop library for your
platform... using builtin-java classes where applicable

13/08/27 23:35:18 WARN bsp.BSPJobClient: No job jar file set.  User classes may not be found.
See BSPJob#setJar(String) or check Your jar file.

13/08/27 23:35:18 INFO bsp.BSPJobClient: Running job: job_localrunner_0001

13/08/27 23:35:18 INFO bsp.LocalBSPRunner: Setting up a new barrier for 2 tasks!

13/08/27 23:35:21 INFO bsp.BSPJobClient: Current supersteps number: 14

13/08/27 23:35:21 INFO bsp.BSPJobClient: The total number of supersteps: 14

13/08/27 23:35:21 INFO bsp.BSPJobClient: Counters: 7

13/08/27 23:35:21 INFO bsp.BSPJobClient:   org.apache.hama.bsp.JobInProgress$JobCounter

13/08/27 23:35:21 INFO bsp.BSPJobClient:     SUPERSTEPS=14

13/08/27 23:35:21 INFO bsp.BSPJobClient:     LAUNCHED_TASKS=2

13/08/27 23:35:21 INFO bsp.BSPJobClient:   org.apache.hama.bsp.BSPPeerImpl$PeerCounter

13/08/27 23:35:21 INFO bsp.BSPJobClient:     SUPERSTEP_SUM=30

13/08/27 23:35:21 INFO bsp.BSPJobClient:     TIME_IN_SYNC_MS=5

13/08/27 23:35:21 INFO bsp.BSPJobClient:     TOTAL_MESSAGES_SENT=60

13/08/27 23:35:21 INFO bsp.BSPJobClient:     TOTAL_MESSAGES_RECEIVED=60

13/08/27 23:35:21 INFO bsp.BSPJobClient:     TASK_OUTPUT_RECORDS=60

Tests run: 1, Failures: 0, Errors: 0, Skipped: 0, Time elapsed: 0.009 sec
Running org.apache.hama.bsp.message.TestSpillingQueue
Tests run: 2, Failures: 0, Errors: 0, Skipped: 0, Time elapsed: 0.009 sec
Running org.apache.hama.zookeeper.TestZKTools
Tests run: 1, Failures: 0, Errors: 0, Skipped: 0, Time elapsed: 0.011 sec
Killed
[INFO] ------------------------------------------------------------------------
[INFO] Reactor Summary:
[INFO] 
[INFO] Apache Hama parent POM ............................ SUCCESS [19.399s]
[INFO] core .............................................. FAILURE [2:12.312s]
[INFO] graph ............................................. SKIPPED
[INFO] machine learning .................................. SKIPPED
[INFO] examples .......................................... SKIPPED
[INFO] hama-dist ......................................... SKIPPED
[INFO] ------------------------------------------------------------------------
[INFO] BUILD FAILURE
[INFO] ------------------------------------------------------------------------
[INFO] Total time: 2:32.802s
[INFO] Finished at: Tue Aug 27 23:35:33 UTC 2013
[INFO] Final Memory: 31M/150M
[INFO] ------------------------------------------------------------------------
[ERROR] Failed to execute goal org.apache.maven.plugins:maven-surefire-plugin:2.6:test (default-test)
on project hama-core: There are test failures.
[ERROR] 
[ERROR] Please refer to <https://builds.apache.org/job/Hama-Nightly-for-Hadoop-1.x/ws/trunk/core/target/surefire-reports>
for the individual test results.
[ERROR] -> [Help 1]
[ERROR] 
[ERROR] To see the full stack trace of the errors, re-run Maven with the -e switch.
[ERROR] Re-run Maven using the -X switch to enable full debug logging.
[ERROR] 
[ERROR] For more information about the errors and possible solutions, please read the following
articles:
[ERROR] [Help 1] http://cwiki.apache.org/confluence/display/MAVEN/MojoFailureException
[ERROR] 
[ERROR] After correcting the problems, you can resume the build with the command
[ERROR]   mvn <goals> -rf :hama-core
Build step 'Invoke top-level Maven targets' marked build as failure
Archiving artifacts
Recording test results

Mime
View raw message