hama-dev mailing list archives

Site index · List index
Message view « Date » · « Thread »
Top « Date » · « Thread »
From Apache Jenkins Server <jenk...@builds.apache.org>
Subject Build failed in Jenkins: Hama trunk #143
Date Fri, 12 Jul 2013 09:05:18 GMT
See <https://builds.apache.org/job/Hama%20trunk/143/changes>

Changes:

[tommaso] HAMA-779 - slightly better configuration name

[tommaso] HAMA-779 - make VerticesInfo implemantation configurable

------------------------------------------
[...truncated 5484 lines...]
13/07/12 09:04:39 INFO server.ZooKeeperServer: Server environment:os.name=Linux

13/07/12 09:04:39 INFO server.ZooKeeperServer: Server environment:os.arch=i386

13/07/12 09:04:39 INFO server.ZooKeeperServer: Server environment:os.version=3.2.0-38-generic

13/07/12 09:04:39 INFO server.ZooKeeperServer: Server environment:user.name=jenkins

13/07/12 09:04:39 INFO server.ZooKeeperServer: Server environment:user.home=/home/jenkins

13/07/12 09:04:39 INFO server.ZooKeeperServer: Server environment:user.dir=/tmp

13/07/12 09:04:39 INFO server.ZooKeeperServer: tickTime set to 3000

13/07/12 09:04:39 INFO server.ZooKeeperServer: minSessionTimeout set to -1

13/07/12 09:04:39 INFO server.ZooKeeperServer: maxSessionTimeout set to 1200000

13/07/12 09:04:39 INFO server.NIOServerCnxnFactory: binding to port 0.0.0.0/0.0.0.0:20000

13/07/12 09:04:39 INFO persistence.FileSnap: Reading snapshot /tmp/hama-testzookeeper/version-2/snapshot.cf

13/07/12 09:04:39 INFO persistence.FileTxnSnapLog: Snapshotting: 0xd5 to /tmp/hama-testzookeeper/version-2/snapshot.d5

13/07/12 09:04:49 INFO zookeeper.ZooKeeper: Client environment:zookeeper.version=3.4.5-1392090,
built on 09/30/2012 17:52 GMT

13/07/12 09:04:49 INFO zookeeper.ZooKeeper: Client environment:host.name=vesta.apache.org

13/07/12 09:04:49 INFO zookeeper.ZooKeeper: Client environment:java.version=1.6.0_45

13/07/12 09:04:49 INFO zookeeper.ZooKeeper: Client environment:java.vendor=Sun Microsystems
Inc.

13/07/12 09:04:49 INFO zookeeper.ZooKeeper: Client environment:java.home=/home/hudson/tools/java/jdk1.6.0_45-32/jre

13/07/12 09:04:49 INFO zookeeper.ZooKeeper: Client environment:java.class.path=/tmp/surefirebooter823360760642325638.jar

13/07/12 09:04:49 INFO zookeeper.ZooKeeper: Client environment:java.library.path=/home/hudson/tools/java/jdk1.6.0_45-32/jre/lib/i386/server:/home/hudson/tools/java/jdk1.6.0_45-32/jre/lib/i386:/home/hudson/tools/java/jdk1.6.0_45-32/jre/../lib/i386:/usr/lib/jvm/java-6-openjdk-amd64/jre/lib/amd64/server:/usr/lib/jvm/java-6-openjdk-amd64/jre/lib/amd64:/usr/lib/jvm/java-6-openjdk-amd64/jre/../lib/amd64:/usr/java/packages/lib/i386:/lib:/usr/lib

13/07/12 09:04:49 INFO zookeeper.ZooKeeper: Client environment:java.io.tmpdir=/tmp

13/07/12 09:04:49 INFO zookeeper.ZooKeeper: Client environment:java.compiler=<NA>

13/07/12 09:04:49 INFO zookeeper.ZooKeeper: Client environment:os.name=Linux

13/07/12 09:04:49 INFO zookeeper.ZooKeeper: Client environment:os.arch=i386

13/07/12 09:04:49 INFO zookeeper.ZooKeeper: Client environment:os.version=3.2.0-38-generic

13/07/12 09:04:49 INFO zookeeper.ZooKeeper: Client environment:user.name=jenkins

13/07/12 09:04:49 INFO zookeeper.ZooKeeper: Client environment:user.home=/home/jenkins

13/07/12 09:04:49 INFO zookeeper.ZooKeeper: Client environment:user.dir=/tmp

13/07/12 09:04:49 INFO zookeeper.ZooKeeper: Initiating client connection, connectString=localhost:20000
sessionTimeout=1200000 watcher=org.apache.hama.bsp.sync.ZKSyncBSPMasterClient@3a9bba

13/07/12 09:04:49 INFO sync.ZKSyncBSPMasterClient: Initialized ZK false

13/07/12 09:04:49 INFO sync.ZKSyncClient: Initializing ZK Sync Client

13/07/12 09:04:49 INFO zookeeper.ClientCnxn: Opening socket connection to server localhost/0:0:0:0:0:0:0:1:20000.
Will not attempt to authenticate using SASL (Unable to locate a login configuration)

13/07/12 09:04:49 INFO zookeeper.ClientCnxn: Socket connection established to localhost/0:0:0:0:0:0:0:1:20000,
initiating session

13/07/12 09:04:49 INFO server.NIOServerCnxnFactory: Accepted socket connection from /0:0:0:0:0:0:0:1:38962

13/07/12 09:04:49 INFO server.ZooKeeperServer: Client attempting to establish new session
at /0:0:0:0:0:0:0:1:38962

13/07/12 09:04:49 INFO persistence.FileTxnLog: Creating new log file: log.d6

13/07/12 09:04:49 INFO server.ZooKeeperServer: Established session 0x13fd21ffcb10000 with
negotiated timeout 1200000 for client /0:0:0:0:0:0:0:1:38962

13/07/12 09:04:49 INFO zookeeper.ClientCnxn: Session establishment complete on server localhost/0:0:0:0:0:0:0:1:20000,
sessionid = 0x13fd21ffcb10000, negotiated timeout = 1200000

13/07/12 09:04:49 INFO mortbay.log: Logging to org.slf4j.impl.Log4jLoggerAdapter(org.mortbay.log)
via org.mortbay.log.Slf4jLog

13/07/12 09:04:49 INFO mortbay.log: Created master and client sync clients

13/07/12 09:04:49 INFO mortbay.log: BSP root exists

13/07/12 09:04:49 INFO zookeeper.ZooKeeper: Initiating client connection, connectString=localhost:20000
sessionTimeout=1200000 watcher=org.apache.hama.bsp.sync.ZooKeeperSyncClientImpl@1860038

13/07/12 09:04:49 INFO sync.ZKSyncClient: Initializing ZK Sync Client

13/07/12 09:04:49 INFO sync.ZooKeeperSyncClientImpl: Start connecting to Zookeeper! At /0.0.0.0:21815

13/07/12 09:04:49 INFO zookeeper.ClientCnxn: Opening socket connection to server localhost/0:0:0:0:0:0:0:1:20000.
Will not attempt to authenticate using SASL (Unable to locate a login configuration)

13/07/12 09:04:49 INFO server.NIOServerCnxnFactory: Accepted socket connection from /0:0:0:0:0:0:0:1:38963

13/07/12 09:04:49 INFO zookeeper.ClientCnxn: Socket connection established to localhost/0:0:0:0:0:0:0:1:20000,
initiating session

13/07/12 09:04:49 INFO server.ZooKeeperServer: Client attempting to establish new session
at /0:0:0:0:0:0:0:1:38963

13/07/12 09:04:49 INFO server.ZooKeeperServer: Established session 0x13fd21ffcb10001 with
negotiated timeout 1200000 for client /0:0:0:0:0:0:0:1:38963

13/07/12 09:04:49 INFO zookeeper.ClientCnxn: Session establishment complete on server localhost/0:0:0:0:0:0:0:1:20000,
sessionid = 0x13fd21ffcb10001, negotiated timeout = 1200000

13/07/12 09:04:49 INFO sync.ZKSyncClient: Writing data /bsp/job_test1_0001/info/level2

13/07/12 09:04:49 INFO mortbay.log: Found child count = 2

13/07/12 09:04:49 INFO mortbay.log: Passed the child count test

13/07/12 09:04:49 INFO mortbay.log: Found child count = 2

13/07/12 09:04:49 INFO mortbay.log:  Peer name 2

13/07/12 09:04:49 INFO mortbay.log:  Peer name 1

13/07/12 09:04:49 INFO mortbay.log: Passed the child key set test

13/07/12 09:04:49 INFO mortbay.log: /bsp/job_test1_0001

13/07/12 09:04:49 INFO mortbay.log: Passed the key presence test

13/07/12 09:04:49 INFO sync.ZKSyncClient: Writing data /bsp/job_test1_0001/info/level3

13/07/12 09:04:49 INFO mortbay.log: Passed array writable test

13/07/12 09:04:49 INFO server.NIOServerCnxn: Closed socket connection for client /0:0:0:0:0:0:0:1:38962
which had sessionid 0x13fd21ffcb10000

13/07/12 09:04:49 INFO zookeeper.ClientCnxn: Unable to read additional data from server sessionid
0x13fd21ffcb10000, likely server has closed socket, closing socket connection and attempting
reconnect

13/07/12 09:04:49 INFO server.NIOServerCnxn: Closed socket connection for client /0:0:0:0:0:0:0:1:38963
which had sessionid 0x13fd21ffcb10001

13/07/12 09:04:49 INFO zookeeper.ClientCnxn: Unable to read additional data from server sessionid
0x13fd21ffcb10001, likely server has closed socket, closing socket connection and attempting
reconnect

13/07/12 09:04:49 INFO server.NIOServerCnxnFactory: NIOServerCnxn factory exited run method

13/07/12 09:04:49 INFO server.ZooKeeperServer: shutting down

13/07/12 09:04:49 INFO server.ZooKeeperServer: shutting down

13/07/12 09:04:49 INFO server.SessionTrackerImpl: Shutting down

13/07/12 09:04:49 INFO server.SessionTrackerImpl: Shutting down

13/07/12 09:04:49 INFO server.PrepRequestProcessor: Shutting down

13/07/12 09:04:49 INFO server.PrepRequestProcessor: Shutting down

13/07/12 09:04:49 INFO server.SyncRequestProcessor: Shutting down

13/07/12 09:04:49 INFO server.SyncRequestProcessor: Shutting down

13/07/12 09:04:49 INFO server.SyncRequestProcessor: SyncRequestProcessor exited!

13/07/12 09:04:49 INFO server.PrepRequestProcessor: PrepRequestProcessor exited loop!

13/07/12 09:04:49 INFO server.FinalRequestProcessor: shutdown of request processor complete

13/07/12 09:04:49 INFO server.FinalRequestProcessor: shutdown of request processor complete

13/07/12 09:04:49 WARN jmx.MBeanRegistry: Failed to unregister MBean InMemoryDataTree

13/07/12 09:04:49 WARN jmx.MBeanRegistry: Error during unregister
javax.management.InstanceNotFoundException: org.apache.ZooKeeperService:name0=StandaloneServer_port-1,name1=InMemoryDataTree
	at com.sun.jmx.interceptor.DefaultMBeanServerInterceptor.getMBean(DefaultMBeanServerInterceptor.java:1094)
	at com.sun.jmx.interceptor.DefaultMBeanServerInterceptor.exclusiveUnregisterMBean(DefaultMBeanServerInterceptor.java:415)
	at com.sun.jmx.interceptor.DefaultMBeanServerInterceptor.unregisterMBean(DefaultMBeanServerInterceptor.java:403)
	at com.sun.jmx.mbeanserver.JmxMBeanServer.unregisterMBean(JmxMBeanServer.java:507)
	at org.apache.zookeeper.jmx.MBeanRegistry.unregister(MBeanRegistry.java:115)
	at org.apache.zookeeper.jmx.MBeanRegistry.unregister(MBeanRegistry.java:132)
	at org.apache.zookeeper.server.ZooKeeperServer.unregisterJMX(ZooKeeperServer.java:443)
	at org.apache.zookeeper.server.ZooKeeperServer.shutdown(ZooKeeperServer.java:436)
	at org.apache.zookeeper.server.NIOServerCnxnFactory.shutdown(NIOServerCnxnFactory.java:271)
	at org.apache.zookeeper.server.ZooKeeperServerMain.shutdown(ZooKeeperServerMain.java:127)
	at org.apache.hama.zookeeper.QuorumPeer$ShutdownableZooKeeperServerMain.shutdown(QuorumPeer.java:407)
	at org.apache.hama.zookeeper.QuorumPeer$ShutdownableZooKeeperServerMain.shutdownZookeeperMain(QuorumPeer.java:402)
	at org.apache.hama.bsp.sync.ZooKeeperSyncServerImpl.stopServer(ZooKeeperSyncServerImpl.java:88)
	at org.apache.hama.bsp.TestZooKeeper.testClearZKNodes(TestZooKeeper.java:187)
	at sun.reflect.NativeMethodAccessorImpl.invoke0(Native Method)
	at sun.reflect.NativeMethodAccessorImpl.invoke(NativeMethodAccessorImpl.java:39)
	at sun.reflect.DelegatingMethodAccessorImpl.invoke(DelegatingMethodAccessorImpl.java:25)
	at java.lang.reflect.Method.invoke(Method.java:597)
	at junit.framework.TestCase.runTest(TestCase.java:168)
	at junit.framework.TestCase.runBare(TestCase.java:134)
	at junit.framework.TestResult$1.protect(TestResult.java:110)
	at junit.framework.TestResult.runProtected(TestResult.java:128)
	at junit.framework.TestResult.run(TestResult.java:113)
	at junit.framework.TestCase.run(TestCase.java:124)
	at junit.framework.TestSuite.runTest(TestSuite.java:232)
	at junit.framework.TestSuite.run(TestSuite.java:227)
	at org.junit.internal.runners.JUnit38ClassRunner.run(JUnit38ClassRunner.java:83)
	at org.junit.runners.Suite.runChild(Suite.java:128)
	at org.junit.runners.Suite.runChild(Suite.java:24)
	at org.junit.runners.ParentRunner$3.run(ParentRunner.java:193)
	at org.junit.runners.ParentRunner$1.schedule(ParentRunner.java:52)
	at org.junit.runners.ParentRunner.runChildren(ParentRunner.java:191)
	at org.junit.runners.ParentRunner.access$000(ParentRunner.java:42)
	at org.junit.runners.ParentRunner$2.evaluate(ParentRunner.java:184)
	at org.junit.runners.ParentRunner.run(ParentRunner.java:236)
	at org.junit.runner.JUnitCore.run(JUnitCore.java:157)
	at org.junit.runner.JUnitCore.run(JUnitCore.java:136)
	at org.junit.runner.JUnitCore.run(JUnitCore.java:127)
	at org.apache.maven.surefire.junitcore.JUnitCoreTestSet.runJunitCore(JUnitCoreTestSet.java:208)
	at org.apache.maven.surefire.junitcore.JUnitCoreTestSet.execute(JUnitCoreTestSet.java:95)
	at org.apache.maven.surefire.junitcore.JUnitCoreTestSet.execute(JUnitCoreTestSet.java:82)
	at org.apache.maven.surefire.junitcore.JUnitCoreDirectoryTestSuite.execute(JUnitCoreDirectoryTestSuite.java:84)
	at org.apache.maven.surefire.Surefire.run(Surefire.java:104)
	at sun.reflect.NativeMethodAccessorImpl.invoke0(Native Method)
	at sun.reflect.NativeMethodAccessorImpl.invoke(NativeMethodAccessorImpl.java:39)
	at sun.reflect.DelegatingMethodAccessorImpl.invoke(DelegatingMethodAccessorImpl.java:25)
	at java.lang.reflect.Method.invoke(Method.java:597)
	at org.apache.maven.surefire.booter.SurefireBooter.runSuitesInProcess(SurefireBooter.java:290)
	at org.apache.maven.surefire.booter.SurefireBooter.main(SurefireBooter.java:1017)

Tests run: 1, Failures: 0, Errors: 0, Skipped: 0, Time elapsed: 0.01 sec

Results :

Failed tests: 

Tests run: 64, Failures: 1, Errors: 0, Skipped: 0

[INFO] ------------------------------------------------------------------------
[INFO] Reactor Summary:
[INFO] 
[INFO] Apache Hama parent POM ............................ SUCCESS [12.017s]
[INFO] core .............................................. FAILURE [3:27.950s]
[INFO] graph ............................................. SKIPPED
[INFO] machine learning .................................. SKIPPED
[INFO] examples .......................................... SKIPPED
[INFO] hama-dist ......................................... SKIPPED
[INFO] ------------------------------------------------------------------------
[INFO] BUILD FAILURE
[INFO] ------------------------------------------------------------------------
[INFO] Total time: 3:41.008s
[INFO] Finished at: Fri Jul 12 09:04:49 UTC 2013
[INFO] Final Memory: 30M/150M
[INFO] ------------------------------------------------------------------------
[ERROR] Failed to execute goal org.apache.maven.plugins:maven-surefire-plugin:2.6:test (default-test)
on project hama-core: There are test failures.
[ERROR] 
[ERROR] Please refer to /home/hudson/jenkins-slave/workspace/Hama trunk/trunk/core/target/surefire-reports
for the individual test results.
[ERROR] -> [Help 1]
[ERROR] 
[ERROR] To see the full stack trace of the errors, re-run Maven with the -e switch.
[ERROR] Re-run Maven using the -X switch to enable full debug logging.
[ERROR] 
[ERROR] For more information about the errors and possible solutions, please read the following
articles:
[ERROR] [Help 1] http://cwiki.apache.org/confluence/display/MAVEN/MojoFailureException
[ERROR] 
[ERROR] After correcting the problems, you can resume the build with the command
[ERROR]   mvn <goals> -rf :hama-core
Build step 'Invoke top-level Maven targets' marked build as failure
Archiving artifacts
Recording test results
Updating HAMA-779

Mime
View raw message