hama-dev mailing list archives

Site index · List index
Message view « Date » · « Thread »
Top « Date » · « Thread »
From Apache Jenkins Server <jenk...@builds.apache.org>
Subject Build failed in Jenkins: Hama trunk #98
Date Wed, 06 Feb 2013 15:18:02 GMT
See <https://builds.apache.org/job/Hama%20trunk/98/changes>

Changes:

[tommaso] HAMA-721 - committed Suraj's patch

------------------------------------------
[...truncated 12803 lines...]
165/223 KB   
169/223 KB   
173/223 KB   
177/223 KB   
181/223 KB   
185/223 KB   
189/223 KB   
191/223 KB   
195/223 KB   
199/223 KB   
203/223 KB   
207/223 KB   
211/223 KB   
215/223 KB   
219/223 KB   
223/223 KB   
             
Downloaded: http://repo.maven.apache.org/maven2/org/codehaus/plexus/plexus-utils/1.5.15/plexus-utils-1.5.15.jar
(223 KB at 5062.8 KB/sec)
[INFO] Using 'UTF-8' encoding to copy filtered resources.
[INFO] Copying 6 resources
[INFO] Copying 3 resources
[INFO] 
[INFO] --- maven-compiler-plugin:2.3.2:compile (default-compile) @ hama-core ---
Downloading: http://repo.maven.apache.org/maven2/org/codehaus/plexus/plexus-compiler-api/1.8.1/plexus-compiler-api-1.8.1.pom
805/805 B    
            
Downloaded: http://repo.maven.apache.org/maven2/org/codehaus/plexus/plexus-compiler-api/1.8.1/plexus-compiler-api-1.8.1.pom
(805 B at 41.4 KB/sec)
Downloading: http://repo.maven.apache.org/maven2/org/codehaus/plexus/plexus-compiler/1.8.1/plexus-compiler-1.8.1.pom
4/4 KB      
         
Downloaded: http://repo.maven.apache.org/maven2/org/codehaus/plexus/plexus-compiler/1.8.1/plexus-compiler-1.8.1.pom
(4 KB at 339.6 KB/sec)
Downloading: http://repo.maven.apache.org/maven2/org/codehaus/plexus/plexus-components/1.1.18/plexus-components-1.1.18.pom
2/6 KB   
6/6 KB   
6/6 KB   
         
Downloaded: http://repo.maven.apache.org/maven2/org/codehaus/plexus/plexus-components/1.1.18/plexus-components-1.1.18.pom
(6 KB at 522.9 KB/sec)
Downloading: http://repo.maven.apache.org/maven2/org/codehaus/plexus/plexus/2.0.7/plexus-2.0.7.pom
4/17 KB   
5/17 KB   
9/17 KB   
13/17 KB   
17/17 KB   
17/17 KB   
           
Downloaded: http://repo.maven.apache.org/maven2/org/codehaus/plexus/plexus/2.0.7/plexus-2.0.7.pom
(17 KB at 281.5 KB/sec)
Downloading: http://repo.maven.apache.org/maven2/org/codehaus/plexus/plexus-compiler-manager/1.8.1/plexus-compiler-manager-1.8.1.pom
713/713 B   
            
Downloaded: http://repo.maven.apache.org/maven2/org/codehaus/plexus/plexus-compiler-manager/1.8.1/plexus-compiler-manager-1.8.1.pom
(713 B at 63.3 KB/sec)
Downloading: http://repo.maven.apache.org/maven2/org/codehaus/plexus/plexus-compiler-javac/1.8.1/plexus-compiler-javac-1.8.1.pom
710/710 B   
            
Downloaded: http://repo.maven.apache.org/maven2/org/codehaus/plexus/plexus-compiler-javac/1.8.1/plexus-compiler-javac-1.8.1.pom
(710 B at 43.3 KB/sec)
Downloading: http://repo.maven.apache.org/maven2/org/codehaus/plexus/plexus-compilers/1.8.1/plexus-compilers-1.8.1.pom
2/2 KB      
         
Downloaded: http://repo.maven.apache.org/maven2/org/codehaus/plexus/plexus-compilers/1.8.1/plexus-compilers-1.8.1.pom
(2 KB at 117.7 KB/sec)
Downloading: http://repo.maven.apache.org/maven2/org/codehaus/plexus/plexus-compiler-api/1.8.1/plexus-compiler-api-1.8.1.jar
Downloading: http://repo.maven.apache.org/maven2/org/codehaus/plexus/plexus-compiler-manager/1.8.1/plexus-compiler-manager-1.8.1.jar
Downloading: http://repo.maven.apache.org/maven2/org/codehaus/plexus/plexus-compiler-javac/1.8.1/plexus-compiler-javac-1.8.1.jar
4/20 KB   
8/20 KB   
12/20 KB   
16/20 KB   
20/20 KB   
20/20 KB   4/6 KB   
20/20 KB   5/6 KB   
20/20 KB   6/6 KB   
20/20 KB   6/6 KB   4/13 KB   
20/20 KB   6/6 KB   8/13 KB   
20/20 KB   6/6 KB   12/13 KB   
20/20 KB   6/6 KB   13/13 KB   
                               
Downloaded: http://repo.maven.apache.org/maven2/org/codehaus/plexus/plexus-compiler-manager/1.8.1/plexus-compiler-manager-1.8.1.jar
(6 KB at 371.4 KB/sec)
                               
Downloaded: http://repo.maven.apache.org/maven2/org/codehaus/plexus/plexus-compiler-javac/1.8.1/plexus-compiler-javac-1.8.1.jar
(13 KB at 873.4 KB/sec)
                               
Downloaded: http://repo.maven.apache.org/maven2/org/codehaus/plexus/plexus-compiler-api/1.8.1/plexus-compiler-api-1.8.1.jar
(20 KB at 928.2 KB/sec)
[INFO] Compiling 193 source files to <https://builds.apache.org/job/Hama%20trunk/ws/trunk/core/target/classes>
[INFO] -------------------------------------------------------------
[ERROR] COMPILATION ERROR : 
[INFO] -------------------------------------------------------------
[ERROR] <https://builds.apache.org/job/Hama%20trunk/ws/trunk/core/src/main/java/org/apache/hama/bsp/message/io/SpilledDataInputBuffer.java>:[371,44]
cannot find symbol
symbol  : class SpilledByteBuffer
location: class org.apache.hama.bsp.message.io.SpilledDataInputBuffer
[ERROR] <https://builds.apache.org/job/Hama%20trunk/ws/trunk/core/src/main/java/org/apache/hama/bsp/message/io/SpilledDataInputBuffer.java>:[57,17]
cannot find symbol
symbol  : class SpilledByteBuffer
location: class org.apache.hama.bsp.message.io.SpilledDataInputBuffer.SpillReadThread
[ERROR] <https://builds.apache.org/job/Hama%20trunk/ws/trunk/core/src/main/java/org/apache/hama/bsp/message/io/SpilledDataInputBuffer.java>:[73,49]
cannot find symbol
symbol  : class SpilledByteBuffer
location: class org.apache.hama.bsp.message.io.SpilledDataInputBuffer.SpillReadThread
[ERROR] <https://builds.apache.org/job/Hama%20trunk/ws/trunk/core/src/main/java/org/apache/hama/bsp/message/io/SpilledDataInputBuffer.java>:[158,17]
cannot find symbol
symbol  : class SpilledByteBuffer
location: class org.apache.hama.bsp.message.io.SpilledDataInputBuffer.SpilledInputStream
[ERROR] <https://builds.apache.org/job/Hama%20trunk/ws/trunk/core/src/main/java/org/apache/hama/bsp/message/io/SpilledDataInputBuffer.java>:[168,12]
cannot find symbol
symbol  : class SpilledByteBuffer
location: class org.apache.hama.bsp.message.io.SpilledDataInputBuffer.SpilledInputStream
[ERROR] <https://builds.apache.org/job/Hama%20trunk/ws/trunk/core/src/main/java/org/apache/hama/bsp/message/io/SpilledDataInputBuffer.java>:[174,13]
cannot find symbol
symbol  : class SpilledByteBuffer
location: class org.apache.hama.bsp.message.io.SpilledDataInputBuffer.SpilledInputStream
[ERROR] <https://builds.apache.org/job/Hama%20trunk/ws/trunk/core/src/main/java/org/apache/hama/bsp/message/io/SpilledDataInputBuffer.java>:[226,11]
cannot find symbol
symbol  : class SpilledByteBuffer
location: class org.apache.hama.bsp.message.io.SpilledDataInputBuffer.SpilledInputStream
[ERROR] <https://builds.apache.org/job/Hama%20trunk/ws/trunk/core/src/main/java/org/apache/hama/bsp/message/io/SpilledDataProcessor.java>:[43,30]
cannot find symbol
symbol  : class SpilledByteBuffer
location: interface org.apache.hama.bsp.message.io.SpilledDataProcessor
[ERROR] <https://builds.apache.org/job/Hama%20trunk/ws/trunk/core/src/main/java/org/apache/hama/bsp/message/io/SpillingDataOutputBuffer.java>:[62,17]
cannot find symbol
symbol  : class SpilledByteBuffer
location: class org.apache.hama.bsp.message.io.SpillingDataOutputBuffer.ProcessSpilledDataThread
[ERROR] <https://builds.apache.org/job/Hama%20trunk/ws/trunk/core/src/main/java/org/apache/hama/bsp/message/io/SpillingDataOutputBuffer.java>:[68,13]
cannot find symbol
symbol  : class SpilledByteBuffer
location: class org.apache.hama.bsp.message.io.SpillingDataOutputBuffer.ProcessSpilledDataThread
[ERROR] <https://builds.apache.org/job/Hama%20trunk/ws/trunk/core/src/main/java/org/apache/hama/bsp/message/io/SpillingDataOutputBuffer.java>:[154,17]
cannot find symbol
symbol  : class SpilledByteBuffer
location: class org.apache.hama.bsp.message.io.SpillingDataOutputBuffer.SpillingStream
[ERROR] <https://builds.apache.org/job/Hama%20trunk/ws/trunk/core/src/main/java/org/apache/hama/bsp/message/io/SpillingDataOutputBuffer.java>:[158,12]
cannot find symbol
symbol  : class SpilledByteBuffer
location: class org.apache.hama.bsp.message.io.SpillingDataOutputBuffer.SpillingStream
[ERROR] <https://builds.apache.org/job/Hama%20trunk/ws/trunk/core/src/main/java/org/apache/hama/bsp/message/io/SpillingDataOutputBuffer.java>:[400,4]
cannot find symbol
symbol  : class SpilledByteBuffer
location: class org.apache.hama.bsp.message.io.SpillingDataOutputBuffer.SpillingStream
[ERROR] <https://builds.apache.org/job/Hama%20trunk/ws/trunk/core/src/main/java/org/apache/hama/bsp/message/io/WriteSpilledDataProcessor.java>:[64,37]
cannot find symbol
symbol  : class SpilledByteBuffer
location: class org.apache.hama.bsp.message.io.WriteSpilledDataProcessor
[ERROR] <https://builds.apache.org/job/Hama%20trunk/ws/trunk/core/src/main/java/org/apache/hama/bsp/message/queue/SpillingQueue.java>:[36,37]
cannot find symbol
symbol  : class CombineSpilledDataProcessor
location: package org.apache.hama.bsp.message.io
[ERROR] <https://builds.apache.org/job/Hama%20trunk/ws/trunk/core/src/main/java/org/apache/hama/bsp/message/io/SpilledDataInputBuffer.java>:[104,8]
cannot find symbol
symbol  : class SpilledByteBuffer
location: class org.apache.hama.bsp.message.io.SpilledDataInputBuffer.SpillReadThread
[ERROR] <https://builds.apache.org/job/Hama%20trunk/ws/trunk/core/src/main/java/org/apache/hama/bsp/message/io/SpillingDataOutputBuffer.java>:[93,10]
cannot find symbol
symbol  : class SpilledByteBuffer
location: class org.apache.hama.bsp.message.io.SpillingDataOutputBuffer.ProcessSpilledDataThread
[ERROR] <https://builds.apache.org/job/Hama%20trunk/ws/trunk/core/src/main/java/org/apache/hama/bsp/message/io/SpillingDataOutputBuffer.java>:[228,34]
cannot find symbol
symbol  : class SpilledByteBuffer
location: class org.apache.hama.bsp.message.io.SpillingDataOutputBuffer.SpillingStream
[ERROR] <https://builds.apache.org/job/Hama%20trunk/ws/trunk/core/src/main/java/org/apache/hama/bsp/message/io/SpillingDataOutputBuffer.java>:[232,28]
cannot find symbol
symbol  : class SpilledByteBuffer
location: class org.apache.hama.bsp.message.io.SpillingDataOutputBuffer.SpillingStream
[ERROR] <https://builds.apache.org/job/Hama%20trunk/ws/trunk/core/src/main/java/org/apache/hama/bsp/message/io/SpillingDataOutputBuffer.java>:[259,13]
cannot find symbol
symbol  : class SpilledByteBuffer
location: class org.apache.hama.bsp.message.io.SpillingDataOutputBuffer.SpillingStream
[ERROR] <https://builds.apache.org/job/Hama%20trunk/ws/trunk/core/src/main/java/org/apache/hama/bsp/message/io/SpillingDataOutputBuffer.java>:[405,28]
cannot find symbol
symbol  : class SpilledByteBuffer
location: class org.apache.hama.bsp.message.io.SpillingDataOutputBuffer.SpillingStream
[ERROR] <https://builds.apache.org/job/Hama%20trunk/ws/trunk/core/src/main/java/org/apache/hama/bsp/message/queue/SpillingQueue.java>:[205,22]
cannot find symbol
symbol  : class CombineSpilledDataProcessor
location: class org.apache.hama.bsp.message.queue.SpillingQueue<M>
[INFO] 22 errors 
[INFO] -------------------------------------------------------------
[INFO] ------------------------------------------------------------------------
[INFO] Reactor Summary:
[INFO] 
[INFO] Apache Hama parent POM ............................ SUCCESS [18.298s]
[INFO] core .............................................. FAILURE [16.470s]
[INFO] graph ............................................. SKIPPED
[INFO] machine learning .................................. SKIPPED
[INFO] examples .......................................... SKIPPED
[INFO] yarn .............................................. SKIPPED
[INFO] hama-dist ......................................... SKIPPED
[INFO] ------------------------------------------------------------------------
[INFO] BUILD FAILURE
[INFO] ------------------------------------------------------------------------
[INFO] Total time: 36.729s
[INFO] Finished at: Wed Feb 06 15:18:00 UTC 2013
[INFO] Final Memory: 24M/573M
[INFO] ------------------------------------------------------------------------
[ERROR] Failed to execute goal org.apache.maven.plugins:maven-compiler-plugin:2.3.2:compile
(default-compile) on project hama-core: Compilation failure: Compilation failure:
[ERROR] <https://builds.apache.org/job/Hama%20trunk/ws/trunk/core/src/main/java/org/apache/hama/bsp/message/io/SpilledDataInputBuffer.java>:[371,44]
cannot find symbol
[ERROR] symbol  : class SpilledByteBuffer
[ERROR] location: class org.apache.hama.bsp.message.io.SpilledDataInputBuffer
[ERROR] <https://builds.apache.org/job/Hama%20trunk/ws/trunk/core/src/main/java/org/apache/hama/bsp/message/io/SpilledDataInputBuffer.java>:[57,17]
cannot find symbol
[ERROR] symbol  : class SpilledByteBuffer
[ERROR] location: class org.apache.hama.bsp.message.io.SpilledDataInputBuffer.SpillReadThread
[ERROR] <https://builds.apache.org/job/Hama%20trunk/ws/trunk/core/src/main/java/org/apache/hama/bsp/message/io/SpilledDataInputBuffer.java>:[73,49]
cannot find symbol
[ERROR] symbol  : class SpilledByteBuffer
[ERROR] location: class org.apache.hama.bsp.message.io.SpilledDataInputBuffer.SpillReadThread
[ERROR] <https://builds.apache.org/job/Hama%20trunk/ws/trunk/core/src/main/java/org/apache/hama/bsp/message/io/SpilledDataInputBuffer.java>:[158,17]
cannot find symbol
[ERROR] symbol  : class SpilledByteBuffer
[ERROR] location: class org.apache.hama.bsp.message.io.SpilledDataInputBuffer.SpilledInputStream
[ERROR] <https://builds.apache.org/job/Hama%20trunk/ws/trunk/core/src/main/java/org/apache/hama/bsp/message/io/SpilledDataInputBuffer.java>:[168,12]
cannot find symbol
[ERROR] symbol  : class SpilledByteBuffer
[ERROR] location: class org.apache.hama.bsp.message.io.SpilledDataInputBuffer.SpilledInputStream
[ERROR] <https://builds.apache.org/job/Hama%20trunk/ws/trunk/core/src/main/java/org/apache/hama/bsp/message/io/SpilledDataInputBuffer.java>:[174,13]
cannot find symbol
[ERROR] symbol  : class SpilledByteBuffer
[ERROR] location: class org.apache.hama.bsp.message.io.SpilledDataInputBuffer.SpilledInputStream
[ERROR] <https://builds.apache.org/job/Hama%20trunk/ws/trunk/core/src/main/java/org/apache/hama/bsp/message/io/SpilledDataInputBuffer.java>:[226,11]
cannot find symbol
[ERROR] symbol  : class SpilledByteBuffer
[ERROR] location: class org.apache.hama.bsp.message.io.SpilledDataInputBuffer.SpilledInputStream
[ERROR] <https://builds.apache.org/job/Hama%20trunk/ws/trunk/core/src/main/java/org/apache/hama/bsp/message/io/SpilledDataProcessor.java>:[43,30]
cannot find symbol
[ERROR] symbol  : class SpilledByteBuffer
[ERROR] location: interface org.apache.hama.bsp.message.io.SpilledDataProcessor
[ERROR] <https://builds.apache.org/job/Hama%20trunk/ws/trunk/core/src/main/java/org/apache/hama/bsp/message/io/SpillingDataOutputBuffer.java>:[62,17]
cannot find symbol
[ERROR] symbol  : class SpilledByteBuffer
[ERROR] location: class org.apache.hama.bsp.message.io.SpillingDataOutputBuffer.ProcessSpilledDataThread
[ERROR] <https://builds.apache.org/job/Hama%20trunk/ws/trunk/core/src/main/java/org/apache/hama/bsp/message/io/SpillingDataOutputBuffer.java>:[68,13]
cannot find symbol
[ERROR] symbol  : class SpilledByteBuffer
[ERROR] location: class org.apache.hama.bsp.message.io.SpillingDataOutputBuffer.ProcessSpilledDataThread
[ERROR] <https://builds.apache.org/job/Hama%20trunk/ws/trunk/core/src/main/java/org/apache/hama/bsp/message/io/SpillingDataOutputBuffer.java>:[154,17]
cannot find symbol
[ERROR] symbol  : class SpilledByteBuffer
[ERROR] location: class org.apache.hama.bsp.message.io.SpillingDataOutputBuffer.SpillingStream
[ERROR] <https://builds.apache.org/job/Hama%20trunk/ws/trunk/core/src/main/java/org/apache/hama/bsp/message/io/SpillingDataOutputBuffer.java>:[158,12]
cannot find symbol
[ERROR] symbol  : class SpilledByteBuffer
[ERROR] location: class org.apache.hama.bsp.message.io.SpillingDataOutputBuffer.SpillingStream
[ERROR] <https://builds.apache.org/job/Hama%20trunk/ws/trunk/core/src/main/java/org/apache/hama/bsp/message/io/SpillingDataOutputBuffer.java>:[400,4]
cannot find symbol
[ERROR] symbol  : class SpilledByteBuffer
[ERROR] location: class org.apache.hama.bsp.message.io.SpillingDataOutputBuffer.SpillingStream
[ERROR] <https://builds.apache.org/job/Hama%20trunk/ws/trunk/core/src/main/java/org/apache/hama/bsp/message/io/WriteSpilledDataProcessor.java>:[64,37]
cannot find symbol
[ERROR] symbol  : class SpilledByteBuffer
[ERROR] location: class org.apache.hama.bsp.message.io.WriteSpilledDataProcessor
[ERROR] <https://builds.apache.org/job/Hama%20trunk/ws/trunk/core/src/main/java/org/apache/hama/bsp/message/queue/SpillingQueue.java>:[36,37]
cannot find symbol
[ERROR] symbol  : class CombineSpilledDataProcessor
[ERROR] location: package org.apache.hama.bsp.message.io
[ERROR] <https://builds.apache.org/job/Hama%20trunk/ws/trunk/core/src/main/java/org/apache/hama/bsp/message/io/SpilledDataInputBuffer.java>:[104,8]
cannot find symbol
[ERROR] symbol  : class SpilledByteBuffer
[ERROR] location: class org.apache.hama.bsp.message.io.SpilledDataInputBuffer.SpillReadThread
[ERROR] <https://builds.apache.org/job/Hama%20trunk/ws/trunk/core/src/main/java/org/apache/hama/bsp/message/io/SpillingDataOutputBuffer.java>:[93,10]
cannot find symbol
[ERROR] symbol  : class SpilledByteBuffer
[ERROR] location: class org.apache.hama.bsp.message.io.SpillingDataOutputBuffer.ProcessSpilledDataThread
[ERROR] <https://builds.apache.org/job/Hama%20trunk/ws/trunk/core/src/main/java/org/apache/hama/bsp/message/io/SpillingDataOutputBuffer.java>:[228,34]
cannot find symbol
[ERROR] symbol  : class SpilledByteBuffer
[ERROR] location: class org.apache.hama.bsp.message.io.SpillingDataOutputBuffer.SpillingStream
[ERROR] <https://builds.apache.org/job/Hama%20trunk/ws/trunk/core/src/main/java/org/apache/hama/bsp/message/io/SpillingDataOutputBuffer.java>:[232,28]
cannot find symbol
[ERROR] symbol  : class SpilledByteBuffer
[ERROR] location: class org.apache.hama.bsp.message.io.SpillingDataOutputBuffer.SpillingStream
[ERROR] <https://builds.apache.org/job/Hama%20trunk/ws/trunk/core/src/main/java/org/apache/hama/bsp/message/io/SpillingDataOutputBuffer.java>:[259,13]
cannot find symbol
[ERROR] symbol  : class SpilledByteBuffer
[ERROR] location: class org.apache.hama.bsp.message.io.SpillingDataOutputBuffer.SpillingStream
[ERROR] <https://builds.apache.org/job/Hama%20trunk/ws/trunk/core/src/main/java/org/apache/hama/bsp/message/io/SpillingDataOutputBuffer.java>:[405,28]
cannot find symbol
[ERROR] symbol  : class SpilledByteBuffer
[ERROR] location: class org.apache.hama.bsp.message.io.SpillingDataOutputBuffer.SpillingStream
[ERROR] <https://builds.apache.org/job/Hama%20trunk/ws/trunk/core/src/main/java/org/apache/hama/bsp/message/queue/SpillingQueue.java>:[205,22]
cannot find symbol
[ERROR] symbol  : class CombineSpilledDataProcessor
[ERROR] location: class org.apache.hama.bsp.message.queue.SpillingQueue<M>
[ERROR] -> [Help 1]
[ERROR] 
[ERROR] To see the full stack trace of the errors, re-run Maven with the -e switch.
[ERROR] Re-run Maven using the -X switch to enable full debug logging.
[ERROR] 
[ERROR] For more information about the errors and possible solutions, please read the following
articles:
[ERROR] [Help 1] http://cwiki.apache.org/confluence/display/MAVEN/MojoFailureException
[ERROR] 
[ERROR] After correcting the problems, you can resume the build with the command
[ERROR]   mvn <goals> -rf :hama-core
Build step 'Invoke top-level Maven targets' marked build as failure
Archiving artifacts
Recording test results
Updating HAMA-721

Mime
View raw message