hama-dev mailing list archives

Site index · List index
Message view « Date » · « Thread »
Top « Date » · « Thread »
From Apache Jenkins Server <jenk...@builds.apache.org>
Subject Build failed in Jenkins: Hama trunk #104
Date Mon, 25 Feb 2013 12:05:42 GMT
See <https://builds.apache.org/job/Hama%20trunk/104/changes>

Changes:

[tjungblut] [HAMA-704]:  Optimization of memory usage during message processing

------------------------------------------
[...truncated 17224 lines...]
13/02/25 12:05:21 INFO server.NIOServerCnxnFactory: NIOServerCnxn factory exited run method

13/02/25 12:05:21 INFO server.ZooKeeperServer: shutting down

13/02/25 12:05:21 INFO server.SessionTrackerImpl: Shutting down

13/02/25 12:05:21 INFO server.PrepRequestProcessor: Shutting down

13/02/25 12:05:21 INFO server.SyncRequestProcessor: Shutting down

13/02/25 12:05:21 INFO server.PrepRequestProcessor: PrepRequestProcessor exited loop!

13/02/25 12:05:21 INFO server.SyncRequestProcessor: SyncRequestProcessor exited!

13/02/25 12:05:21 INFO server.FinalRequestProcessor: shutdown of request processor complete

Tests run: 1, Failures: 0, Errors: 0, Skipped: 0, Time elapsed: 0.01 sec

Results :

Tests run: 8, Failures: 0, Errors: 0, Skipped: 0

[INFO] 
[INFO] --- maven-jar-plugin:2.3:jar (default-jar) @ hama-graph ---
Downloading: http://repo.maven.apache.org/maven2/org/apache/maven/maven-archiver/2.4/maven-archiver-2.4.pom
4/4 KB     
         
Downloaded: http://repo.maven.apache.org/maven2/org/apache/maven/maven-archiver/2.4/maven-archiver-2.4.pom
(4 KB at 304.8 KB/sec)
Downloading: http://repo.maven.apache.org/maven2/org/codehaus/plexus/plexus-archiver/1.0-alpha-11/plexus-archiver-1.0-alpha-11.pom
2/2 KB   
         
Downloaded: http://repo.maven.apache.org/maven2/org/codehaus/plexus/plexus-archiver/1.0-alpha-11/plexus-archiver-1.0-alpha-11.pom
(2 KB at 73.4 KB/sec)
Downloading: http://repo.maven.apache.org/maven2/org/codehaus/plexus/plexus-io/1.0-alpha-3/plexus-io-1.0-alpha-3.pom
2/2 KB   
2/2 KB   
         
Downloaded: http://repo.maven.apache.org/maven2/org/codehaus/plexus/plexus-io/1.0-alpha-3/plexus-io-1.0-alpha-3.pom
(2 KB at 105.8 KB/sec)
Downloading: http://repo.maven.apache.org/maven2/org/codehaus/plexus/plexus-interpolation/1.6/plexus-interpolation-1.6.pom
3/3 KB   
         
Downloaded: http://repo.maven.apache.org/maven2/org/codehaus/plexus/plexus-interpolation/1.6/plexus-interpolation-1.6.pom
(3 KB at 63.1 KB/sec)
Downloading: http://repo.maven.apache.org/maven2/org/codehaus/plexus/plexus-archiver/1.0-alpha-12/plexus-archiver-1.0-alpha-12.pom
2/2 KB   
         
Downloaded: http://repo.maven.apache.org/maven2/org/codehaus/plexus/plexus-archiver/1.0-alpha-12/plexus-archiver-1.0-alpha-12.pom
(2 KB at 76.9 KB/sec)
Downloading: http://repo.maven.apache.org/maven2/org/codehaus/plexus/plexus-io/1.0-alpha-4/plexus-io-1.0-alpha-4.pom
2/2 KB   
         
Downloaded: http://repo.maven.apache.org/maven2/org/codehaus/plexus/plexus-io/1.0-alpha-4/plexus-io-1.0-alpha-4.pom
(2 KB at 19.4 KB/sec)
Downloading: http://repo.maven.apache.org/maven2/org/apache/maven/maven-archiver/2.4/maven-archiver-2.4.jar
Downloading: http://repo.maven.apache.org/maven2/org/codehaus/plexus/plexus-interpolation/1.6/plexus-interpolation-1.6.jar
Downloading: http://repo.maven.apache.org/maven2/org/codehaus/plexus/plexus-archiver/1.0-alpha-12/plexus-archiver-1.0-alpha-12.jar
Downloading: http://repo.maven.apache.org/maven2/org/codehaus/plexus/plexus-io/1.0-alpha-4/plexus-io-1.0-alpha-4.jar
Downloading: http://repo.maven.apache.org/maven2/org/codehaus/plexus/plexus-utils/1.4.9/plexus-utils-1.4.9.jar
2/20 KB   
4/173 KB   2/20 KB   
4/200 KB   4/173 KB   2/20 KB   
7/200 KB   4/173 KB   2/20 KB   
11/200 KB   4/173 KB   2/20 KB   
15/200 KB   4/173 KB   2/20 KB   
15/200 KB   4/48 KB   4/173 KB   2/20 KB   
19/200 KB   4/48 KB   4/173 KB   2/20 KB   
23/200 KB   4/48 KB   4/173 KB   2/20 KB   
27/200 KB   4/48 KB   4/173 KB   2/20 KB   
31/200 KB   4/48 KB   4/173 KB   2/20 KB   
34/200 KB   4/48 KB   4/173 KB   2/20 KB   
38/200 KB   4/48 KB   4/173 KB   2/20 KB   
42/200 KB   4/48 KB   4/173 KB   2/20 KB   
46/200 KB   4/48 KB   4/173 KB   2/20 KB   
50/200 KB   4/48 KB   4/173 KB   2/20 KB   
54/200 KB   4/48 KB   4/173 KB   2/20 KB   
58/200 KB   4/48 KB   4/173 KB   2/20 KB   
60/200 KB   4/48 KB   4/173 KB   2/20 KB   
62/200 KB   4/48 KB   4/173 KB   2/20 KB   
66/200 KB   4/48 KB   4/173 KB   2/20 KB   
70/200 KB   4/48 KB   4/173 KB   2/20 KB   
73/200 KB   4/48 KB   4/173 KB   2/20 KB   
77/200 KB   4/48 KB   4/173 KB   2/20 KB   
81/200 KB   4/48 KB   4/173 KB   2/20 KB   
85/200 KB   4/48 KB   4/173 KB   2/20 KB   
89/200 KB   4/48 KB   4/173 KB   2/20 KB   
93/200 KB   4/48 KB   4/173 KB   2/20 KB   
94/200 KB   4/48 KB   4/173 KB   2/20 KB   
97/200 KB   4/48 KB   4/173 KB   2/20 KB   
99/200 KB   4/48 KB   4/173 KB   2/20 KB   
100/200 KB   4/48 KB   4/173 KB   2/20 KB   
103/200 KB   4/48 KB   4/173 KB   2/20 KB   
107/200 KB   4/48 KB   4/173 KB   2/20 KB   
111/200 KB   4/48 KB   4/173 KB   2/20 KB   
115/200 KB   4/48 KB   4/173 KB   2/20 KB   
117/200 KB   4/48 KB   4/173 KB   2/20 KB   
121/200 KB   4/48 KB   4/173 KB   2/20 KB   
125/200 KB   4/48 KB   4/173 KB   2/20 KB   
129/200 KB   4/48 KB   4/173 KB   2/20 KB   
133/200 KB   4/48 KB   4/173 KB   2/20 KB   
137/200 KB   4/48 KB   4/173 KB   2/20 KB   
141/200 KB   4/48 KB   4/173 KB   2/20 KB   
145/200 KB   4/48 KB   4/173 KB   2/20 KB   
149/200 KB   4/48 KB   4/173 KB   2/20 KB   
153/200 KB   4/48 KB   4/173 KB   2/20 KB   
157/200 KB   4/48 KB   4/173 KB   2/20 KB   
161/200 KB   4/48 KB   4/173 KB   2/20 KB   
165/200 KB   4/48 KB   4/173 KB   2/20 KB   
169/200 KB   4/48 KB   4/173 KB   2/20 KB   
173/200 KB   4/48 KB   4/173 KB   2/20 KB   
177/200 KB   4/48 KB   4/173 KB   2/20 KB   
181/200 KB   4/48 KB   4/173 KB   2/20 KB   
185/200 KB   4/48 KB   4/173 KB   2/20 KB   
189/200 KB   4/48 KB   4/173 KB   2/20 KB   
193/200 KB   4/48 KB   4/173 KB   2/20 KB   
197/200 KB   4/48 KB   4/173 KB   2/20 KB   
200/200 KB   4/48 KB   4/173 KB   2/20 KB   
                                            
Downloaded: http://repo.maven.apache.org/maven2/org/codehaus/plexus/plexus-utils/1.4.9/plexus-utils-1.4.9.jar
(200 KB at 9961.7 KB/sec)
8/48 KB   7/173 KB   2/20 KB                
8/48 KB   7/173 KB   2/20 KB   
8/48 KB   7/173 KB   6/20 KB   
8/48 KB   11/173 KB   6/20 KB   
12/48 KB   11/173 KB   6/20 KB   
12/48 KB   11/173 KB   10/20 KB   
12/48 KB   15/173 KB   10/20 KB   
16/48 KB   15/173 KB   10/20 KB   
16/48 KB   15/173 KB   14/20 KB   
16/48 KB   19/173 KB   14/20 KB   
20/48 KB   19/173 KB   14/20 KB   
20/48 KB   19/173 KB   15/20 KB   
20/48 KB   23/173 KB   15/20 KB   
24/48 KB   23/173 KB   15/20 KB   
24/48 KB   27/173 KB   15/20 KB   
28/48 KB   27/173 KB   15/20 KB   
32/48 KB   27/173 KB   15/20 KB   
32/48 KB   31/173 KB   15/20 KB   
36/48 KB   31/173 KB   15/20 KB   
36/48 KB   35/173 KB   15/20 KB   
40/48 KB   35/173 KB   15/20 KB   
40/48 KB   39/173 KB   15/20 KB   
44/48 KB   39/173 KB   15/20 KB   
44/48 KB   43/173 KB   15/20 KB   
47/48 KB   43/173 KB   15/20 KB   
47/48 KB   47/173 KB   15/20 KB   
47/48 KB   51/173 KB   15/20 KB   
47/48 KB   54/173 KB   15/20 KB   
48/48 KB   54/173 KB   15/20 KB   
48/48 KB   58/173 KB   15/20 KB   
48/48 KB   58/173 KB   19/20 KB   
48/48 KB   62/173 KB   19/20 KB   
48/48 KB   62/173 KB   20/20 KB   
48/48 KB   66/173 KB   20/20 KB   
48/48 KB   69/173 KB   20/20 KB   
48/48 KB   73/173 KB   20/20 KB   
48/48 KB   73/173 KB   20/20 KB   
48/48 KB   77/173 KB   20/20 KB   
48/48 KB   80/173 KB   20/20 KB   
48/48 KB   84/173 KB   20/20 KB   
48/48 KB   88/173 KB   20/20 KB   
48/48 KB   92/173 KB   20/20 KB   
48/48 KB   96/173 KB   20/20 KB   
48/48 KB   97/173 KB   20/20 KB   
48/48 KB   101/173 KB   20/20 KB   
48/48 KB   102/173 KB   20/20 KB   
48/48 KB   104/173 KB   20/20 KB   
48/48 KB   108/173 KB   20/20 KB   
                                   
Downloaded: http://repo.maven.apache.org/maven2/org/codehaus/plexus/plexus-io/1.0-alpha-4/plexus-io-1.0-alpha-4.jar
(48 KB at 1523.8 KB/sec)
112/173 KB   20/20 KB              
116/173 KB   20/20 KB   
120/173 KB   20/20 KB   
124/173 KB   20/20 KB   
                        
128/173 KB              
Downloaded: http://repo.maven.apache.org/maven2/org/apache/maven/maven-archiver/2.4/maven-archiver-2.4.jar
(20 KB at 618.1 KB/sec)
132/173 KB   
136/173 KB   
140/173 KB   
144/173 KB   
148/173 KB   
152/173 KB   
156/173 KB   
160/173 KB   
164/173 KB   
168/173 KB   
172/173 KB   
173/173 KB   
             
Downloaded: http://repo.maven.apache.org/maven2/org/codehaus/plexus/plexus-archiver/1.0-alpha-12/plexus-archiver-1.0-alpha-12.jar
(173 KB at 4669.7 KB/sec)
4/50 KB      
7/50 KB   
11/50 KB   
15/50 KB   
19/50 KB   
20/50 KB   
24/50 KB   
28/50 KB   
32/50 KB   
33/50 KB   
37/50 KB   
41/50 KB   
45/50 KB   
49/50 KB   
50/50 KB   
           
Downloaded: http://repo.maven.apache.org/maven2/org/codehaus/plexus/plexus-interpolation/1.6/plexus-interpolation-1.6.jar
(50 KB at 524.3 KB/sec)
[INFO] Building jar: <https://builds.apache.org/job/Hama%20trunk/ws/trunk/graph/target/hama-graph-0.7.0-SNAPSHOT.jar>
[INFO] 
[INFO] --- apache-rat-plugin:0.8:check (default) @ hama-graph ---
[INFO] Exclude: .idea/**
[INFO] Exclude: .git/**
[INFO] Exclude: .classpath/**
[INFO] Exclude: .project
[INFO] Exclude: **/*.asc
[INFO] Exclude: **/logs/**
[INFO] Exclude: **/docs/**
[INFO] Exclude: CHANGES.txt
[INFO] Exclude: conf/groomservers
[INFO] Exclude: src/site/resources/files/hama-eclipse-formatter.xml
[INFO] Exclude: **/src/test/resources/*.properties
[INFO] Exclude: **dependency-reduced-pom.xml
[INFO] Exclude: **/src/test/resources/*.txt
[INFO] ------------------------------------------------------------------------
[INFO] Reactor Summary:
[INFO] 
[INFO] Apache Hama parent POM ............................ SUCCESS [15.353s]
[INFO] core .............................................. SUCCESS [3:34.342s]
[INFO] graph ............................................. FAILURE [34.040s]
[INFO] machine learning .................................. SKIPPED
[INFO] examples .......................................... SKIPPED
[INFO] yarn .............................................. SKIPPED
[INFO] hama-dist ......................................... SKIPPED
[INFO] ------------------------------------------------------------------------
[INFO] BUILD FAILURE
[INFO] ------------------------------------------------------------------------
[INFO] Total time: 4:25.231s
[INFO] Finished at: Mon Feb 25 12:05:23 UTC 2013
[INFO] Final Memory: 41M/137M
[INFO] ------------------------------------------------------------------------
[ERROR] Failed to execute goal org.apache.rat:apache-rat-plugin:0.8:check (default) on project
hama-graph: Too many unapproved licenses: 1 -> [Help 1]
[ERROR] 
[ERROR] To see the full stack trace of the errors, re-run Maven with the -e switch.
[ERROR] Re-run Maven using the -X switch to enable full debug logging.
[ERROR] 
[ERROR] For more information about the errors and possible solutions, please read the following
articles:
[ERROR] [Help 1] http://cwiki.apache.org/confluence/display/MAVEN/MojoFailureException
[ERROR] 
[ERROR] After correcting the problems, you can resume the build with the command
[ERROR]   mvn <goals> -rf :hama-graph
Build step 'Invoke top-level Maven targets' marked build as failure
Archiving artifacts
Recording test results
Updating HAMA-704

Mime
View raw message