hama-dev mailing list archives

Site index · List index
Message view « Date » · « Thread »
Top « Date » · « Thread »
From Apache Jenkins Server <jenk...@builds.apache.org>
Subject Build failed in Jenkins: Hama-Nightly #794
Date Sat, 12 Jan 2013 23:05:02 GMT
See <https://builds.apache.org/job/Hama-Nightly/794/>

------------------------------------------
[...truncated 2422 lines...]
13/01/12 23:04:39 INFO bsp.BSPJobClient:     TASK_OUTPUT_RECORDS=60

Tests run: 1, Failures: 0, Errors: 0, Skipped: 0, Time elapsed: 0.008 sec
Running org.apache.hama.monitor.TestConfigurator
13/01/12 23:04:39 INFO monitor.TestConfigurator: Plugins dir is not created, returned tasks
should be null -> null

Tests run: 1, Failures: 0, Errors: 0, Skipped: 0, Time elapsed: 0.011 sec
Running org.apache.hama.zookeeper.TestZKTools
Tests run: 1, Failures: 0, Errors: 0, Skipped: 0, Time elapsed: 0.009 sec
Running org.apache.hama.bsp.TestZooKeeper
13/01/12 23:04:41 ERROR quorum.QuorumPeerConfig: Invalid configuration, only one server specified
(ignoring)

13/01/12 23:04:41 INFO server.ZooKeeperServerMain: Starting server

13/01/12 23:04:41 INFO server.ZooKeeperServer: Server environment:zookeeper.version=3.4.5-1392090,
built on 09/30/2012 17:52 GMT

13/01/12 23:04:41 INFO server.ZooKeeperServer: Server environment:host.name=vesta.apache.org

13/01/12 23:04:41 INFO server.ZooKeeperServer: Server environment:java.version=1.6.0_27

13/01/12 23:04:41 INFO server.ZooKeeperServer: Server environment:java.vendor=Sun Microsystems
Inc.

13/01/12 23:04:41 INFO server.ZooKeeperServer: Server environment:java.home=/home/hudson/tools/java/jdk1.6.0_27-32/jre

13/01/12 23:04:41 INFO server.ZooKeeperServer: Server environment:java.class.path=/tmp/surefirebooter7207077595116734348.jar

13/01/12 23:04:41 INFO server.ZooKeeperServer: Server environment:java.library.path=/home/hudson/tools/java/jdk1.6.0_27-32/jre/lib/i386/server:/home/hudson/tools/java/jdk1.6.0_27-32/jre/lib/i386:/home/hudson/tools/java/jdk1.6.0_27-32/jre/../lib/i386:/usr/lib/jvm/java-6-openjdk/jre/lib/amd64/server:/usr/lib/jvm/java-6-openjdk/jre/lib/amd64:/usr/lib/jvm/java-6-openjdk/jre/../lib/amd64:/usr/java/packages/lib/i386:/lib:/usr/lib

13/01/12 23:04:41 INFO server.ZooKeeperServer: Server environment:java.io.tmpdir=/tmp

13/01/12 23:04:41 INFO server.ZooKeeperServer: Server environment:java.compiler=<NA>

13/01/12 23:04:41 INFO server.ZooKeeperServer: Server environment:os.name=Linux

13/01/12 23:04:41 INFO server.ZooKeeperServer: Server environment:os.arch=i386

13/01/12 23:04:41 INFO server.ZooKeeperServer: Server environment:os.version=2.6.32-45-server

13/01/12 23:04:41 INFO server.ZooKeeperServer: Server environment:user.name=hudson

13/01/12 23:04:41 INFO server.ZooKeeperServer: Server environment:user.home=/home/hudson

13/01/12 23:04:41 INFO server.ZooKeeperServer: Server environment:user.dir=/tmp

13/01/12 23:04:41 INFO server.ZooKeeperServer: tickTime set to 3000

13/01/12 23:04:41 INFO server.ZooKeeperServer: minSessionTimeout set to -1

13/01/12 23:04:41 INFO server.ZooKeeperServer: maxSessionTimeout set to 1200000

13/01/12 23:04:41 INFO server.NIOServerCnxnFactory: binding to port 0.0.0.0/0.0.0.0:20000

13/01/12 23:04:41 INFO persistence.FileSnap: Reading snapshot /tmp/hama-testzookeeper/version-2/snapshot.116

13/01/12 23:04:41 INFO persistence.FileTxnSnapLog: Snapshotting: 0x11c to /tmp/hama-testzookeeper/version-2/snapshot.11c

13/01/12 23:04:51 INFO zookeeper.ZooKeeper: Client environment:zookeeper.version=3.4.5-1392090,
built on 09/30/2012 17:52 GMT

13/01/12 23:04:51 INFO zookeeper.ZooKeeper: Client environment:host.name=vesta.apache.org

13/01/12 23:04:51 INFO zookeeper.ZooKeeper: Client environment:java.version=1.6.0_27

13/01/12 23:04:51 INFO zookeeper.ZooKeeper: Client environment:java.vendor=Sun Microsystems
Inc.

13/01/12 23:04:51 INFO zookeeper.ZooKeeper: Client environment:java.home=/home/hudson/tools/java/jdk1.6.0_27-32/jre

13/01/12 23:04:51 INFO zookeeper.ZooKeeper: Client environment:java.class.path=/tmp/surefirebooter7207077595116734348.jar

13/01/12 23:04:51 INFO zookeeper.ZooKeeper: Client environment:java.library.path=/home/hudson/tools/java/jdk1.6.0_27-32/jre/lib/i386/server:/home/hudson/tools/java/jdk1.6.0_27-32/jre/lib/i386:/home/hudson/tools/java/jdk1.6.0_27-32/jre/../lib/i386:/usr/lib/jvm/java-6-openjdk/jre/lib/amd64/server:/usr/lib/jvm/java-6-openjdk/jre/lib/amd64:/usr/lib/jvm/java-6-openjdk/jre/../lib/amd64:/usr/java/packages/lib/i386:/lib:/usr/lib

13/01/12 23:04:51 INFO zookeeper.ZooKeeper: Client environment:java.io.tmpdir=/tmp

13/01/12 23:04:51 INFO zookeeper.ZooKeeper: Client environment:java.compiler=<NA>

13/01/12 23:04:51 INFO zookeeper.ZooKeeper: Client environment:os.name=Linux

13/01/12 23:04:51 INFO zookeeper.ZooKeeper: Client environment:os.arch=i386

13/01/12 23:04:51 INFO zookeeper.ZooKeeper: Client environment:os.version=2.6.32-45-server

13/01/12 23:04:51 INFO zookeeper.ZooKeeper: Client environment:user.name=hudson

13/01/12 23:04:51 INFO zookeeper.ZooKeeper: Client environment:user.home=/home/hudson

13/01/12 23:04:51 INFO zookeeper.ZooKeeper: Client environment:user.dir=/tmp

13/01/12 23:04:51 INFO zookeeper.ZooKeeper: Initiating client connection, connectString=localhost:20000
sessionTimeout=1200000 watcher=org.apache.hama.bsp.sync.ZKSyncBSPMasterClient@14d7745

13/01/12 23:04:51 INFO sync.ZKSyncBSPMasterClient: Initialized ZK false

13/01/12 23:04:51 INFO sync.ZKSyncClient: Initializing ZK Sync Client

13/01/12 23:04:51 INFO zookeeper.ClientCnxn: Opening socket connection to server localhost/0:0:0:0:0:0:0:1:20000.
Will not attempt to authenticate using SASL (Unable to locate a login configuration)

13/01/12 23:04:51 INFO zookeeper.ClientCnxn: Socket connection established to localhost/0:0:0:0:0:0:0:1:20000,
initiating session

13/01/12 23:04:51 INFO server.NIOServerCnxnFactory: Accepted socket connection from /0:0:0:0:0:0:0:1:39855

13/01/12 23:04:51 INFO server.ZooKeeperServer: Client attempting to establish new session
at /0:0:0:0:0:0:0:1:39855

13/01/12 23:04:51 INFO persistence.FileTxnLog: Creating new log file: log.11d

13/01/12 23:04:51 INFO server.ZooKeeperServer: Established session 0x13c310204250000 with
negotiated timeout 1200000 for client /0:0:0:0:0:0:0:1:39855

13/01/12 23:04:51 INFO zookeeper.ClientCnxn: Session establishment complete on server localhost/0:0:0:0:0:0:0:1:20000,
sessionid = 0x13c310204250000, negotiated timeout = 1200000

13/01/12 23:04:51 INFO mortbay.log: Logging to org.slf4j.impl.Log4jLoggerAdapter(org.mortbay.log)
via org.mortbay.log.Slf4jLog

13/01/12 23:04:51 INFO mortbay.log: Created master and client sync clients

13/01/12 23:04:51 INFO mortbay.log: BSP root exists

13/01/12 23:04:51 INFO zookeeper.ZooKeeper: Initiating client connection, connectString=localhost:20000
sessionTimeout=1200000 watcher=org.apache.hama.bsp.sync.ZooKeeperSyncClientImpl@14a7a12

13/01/12 23:04:51 INFO sync.ZKSyncClient: Initializing ZK Sync Client

13/01/12 23:04:51 INFO sync.ZooKeeperSyncClientImpl: Start connecting to Zookeeper! At /0.0.0.0:21815

13/01/12 23:04:51 INFO zookeeper.ClientCnxn: Opening socket connection to server localhost/0:0:0:0:0:0:0:1:20000.
Will not attempt to authenticate using SASL (Unable to locate a login configuration)

13/01/12 23:04:51 INFO server.NIOServerCnxnFactory: Accepted socket connection from /0:0:0:0:0:0:0:1:39856

13/01/12 23:04:51 INFO zookeeper.ClientCnxn: Socket connection established to localhost/0:0:0:0:0:0:0:1:20000,
initiating session

13/01/12 23:04:51 INFO server.ZooKeeperServer: Client attempting to establish new session
at /0:0:0:0:0:0:0:1:39856

13/01/12 23:04:51 INFO server.ZooKeeperServer: Established session 0x13c310204250001 with
negotiated timeout 1200000 for client /0:0:0:0:0:0:0:1:39856

13/01/12 23:04:51 INFO zookeeper.ClientCnxn: Session establishment complete on server localhost/0:0:0:0:0:0:0:1:20000,
sessionid = 0x13c310204250001, negotiated timeout = 1200000

13/01/12 23:04:51 INFO sync.ZKSyncClient: Writing data /bsp/job_test1_0001/info/level2

13/01/12 23:04:51 INFO mortbay.log: Found child count = 2

13/01/12 23:04:51 INFO mortbay.log: Passed the child count test

13/01/12 23:04:51 INFO mortbay.log: Found child count = 2

13/01/12 23:04:51 INFO mortbay.log:  Peer name 2

13/01/12 23:04:51 INFO mortbay.log:  Peer name 1

13/01/12 23:04:51 INFO mortbay.log: Passed the child key set test

13/01/12 23:04:51 INFO mortbay.log: /bsp/job_test1_0001

13/01/12 23:04:51 INFO mortbay.log: Passed the key presence test

13/01/12 23:04:51 INFO sync.ZKSyncClient: Writing data /bsp/job_test1_0001/info/level3

13/01/12 23:04:51 INFO mortbay.log: Passed array writable test

13/01/12 23:04:51 INFO server.NIOServerCnxn: Closed socket connection for client /0:0:0:0:0:0:0:1:39856
which had sessionid 0x13c310204250001

13/01/12 23:04:51 INFO server.NIOServerCnxn: Closed socket connection for client /0:0:0:0:0:0:0:1:39855
which had sessionid 0x13c310204250000

13/01/12 23:04:51 INFO zookeeper.ClientCnxn: Unable to read additional data from server sessionid
0x13c310204250001, likely server has closed socket, closing socket connection and attempting
reconnect

13/01/12 23:04:51 INFO server.NIOServerCnxnFactory: NIOServerCnxn factory exited run method

13/01/12 23:04:51 INFO zookeeper.ClientCnxn: Unable to read additional data from server sessionid
0x13c310204250000, likely server has closed socket, closing socket connection and attempting
reconnect

13/01/12 23:04:51 INFO server.ZooKeeperServer: shutting down

13/01/12 23:04:51 INFO server.ZooKeeperServer: shutting down

13/01/12 23:04:51 INFO server.SessionTrackerImpl: Shutting down

13/01/12 23:04:51 INFO server.SessionTrackerImpl: Shutting down

13/01/12 23:04:51 INFO server.PrepRequestProcessor: Shutting down

13/01/12 23:04:51 INFO server.PrepRequestProcessor: Shutting down

13/01/12 23:04:51 INFO server.SyncRequestProcessor: Shutting down

13/01/12 23:04:51 INFO server.SyncRequestProcessor: Shutting down

13/01/12 23:04:51 INFO server.PrepRequestProcessor: PrepRequestProcessor exited loop!

13/01/12 23:04:51 INFO server.SyncRequestProcessor: SyncRequestProcessor exited!

13/01/12 23:04:51 INFO server.FinalRequestProcessor: shutdown of request processor complete

13/01/12 23:04:51 INFO server.FinalRequestProcessor: shutdown of request processor complete

13/01/12 23:04:51 WARN jmx.MBeanRegistry: Failed to unregister MBean InMemoryDataTree

13/01/12 23:04:51 WARN jmx.MBeanRegistry: Error during unregister
javax.management.InstanceNotFoundException: org.apache.ZooKeeperService:name0=StandaloneServer_port-1,name1=InMemoryDataTree
	at com.sun.jmx.interceptor.DefaultMBeanServerInterceptor.getMBean(DefaultMBeanServerInterceptor.java:1094)
	at com.sun.jmx.interceptor.DefaultMBeanServerInterceptor.exclusiveUnregisterMBean(DefaultMBeanServerInterceptor.java:415)
	at com.sun.jmx.interceptor.DefaultMBeanServerInterceptor.unregisterMBean(DefaultMBeanServerInterceptor.java:403)
	at com.sun.jmx.mbeanserver.JmxMBeanServer.unregisterMBean(JmxMBeanServer.java:506)
	at org.apache.zookeeper.jmx.MBeanRegistry.unregister(MBeanRegistry.java:115)
	at org.apache.zookeeper.jmx.MBeanRegistry.unregister(MBeanRegistry.java:132)
	at org.apache.zookeeper.server.ZooKeeperServer.unregisterJMX(ZooKeeperServer.java:443)
	at org.apache.zookeeper.server.ZooKeeperServer.shutdown(ZooKeeperServer.java:436)
	at org.apache.zookeeper.server.ZooKeeperServerMain.runFromConfig(ZooKeeperServerMain.java:115)
	at org.apache.hama.bsp.sync.ZooKeeperSyncServerImpl.start(ZooKeeperSyncServerImpl.java:80)
	at org.apache.hama.bsp.TestZooKeeper$1.run(TestZooKeeper.java:76)
	at java.util.concurrent.Executors$RunnableAdapter.call(Executors.java:441)
	at java.util.concurrent.FutureTask$Sync.innerRun(FutureTask.java:303)
	at java.util.concurrent.FutureTask.run(FutureTask.java:138)
	at java.util.concurrent.ThreadPoolExecutor$Worker.runTask(ThreadPoolExecutor.java:886)
	at java.util.concurrent.ThreadPoolExecutor$Worker.run(ThreadPoolExecutor.java:908)
	at java.lang.Thread.run(Thread.java:662)

Tests run: 1, Failures: 0, Errors: 0, Skipped: 0, Time elapsed: 0.011 sec

Results :

Tests in error: 

Tests run: 48, Failures: 0, Errors: 2, Skipped: 0

[INFO] ------------------------------------------------------------------------
[INFO] Reactor Summary:
[INFO] 
[INFO] Apache Hama parent POM ............................ SUCCESS [10.846s]
[INFO] core .............................................. FAILURE [2:38.350s]
[INFO] graph ............................................. SKIPPED
[INFO] machine learning .................................. SKIPPED
[INFO] examples .......................................... SKIPPED
[INFO] yarn .............................................. SKIPPED
[INFO] hama-dist ......................................... SKIPPED
[INFO] ------------------------------------------------------------------------
[INFO] BUILD FAILURE
[INFO] ------------------------------------------------------------------------
[INFO] Total time: 2:49.906s
[INFO] Finished at: Sat Jan 12 23:04:52 UTC 2013
[INFO] Final Memory: 29M/134M
[INFO] ------------------------------------------------------------------------
[ERROR] Failed to execute goal org.apache.maven.plugins:maven-surefire-plugin:2.6:test (default-test)
on project hama-core: There are test failures.
[ERROR] 
[ERROR] Please refer to <https://builds.apache.org/job/Hama-Nightly/ws/trunk/core/target/surefire-reports>
for the individual test results.
[ERROR] -> [Help 1]
[ERROR] 
[ERROR] To see the full stack trace of the errors, re-run Maven with the -e switch.
[ERROR] Re-run Maven using the -X switch to enable full debug logging.
[ERROR] 
[ERROR] For more information about the errors and possible solutions, please read the following
articles:
[ERROR] [Help 1] http://cwiki.apache.org/confluence/display/MAVEN/MojoFailureException
[ERROR] 
[ERROR] After correcting the problems, you can resume the build with the command
[ERROR]   mvn <goals> -rf :hama-core
Build step 'Invoke top-level Maven targets' marked build as failure
Archiving artifacts
Recording test results

Mime
View raw message