hama-dev mailing list archives

Site index · List index
Message view « Date » · « Thread »
Top « Date » · « Thread »
From Apache Jenkins Server <jenk...@builds.apache.org>
Subject Build failed in Jenkins: Hama-Nightly #743
Date Tue, 20 Nov 2012 23:28:48 GMT
See <https://builds.apache.org/job/Hama-Nightly/743/>

------------------------------------------
[...truncated 2459 lines...]
12/11/20 23:28:32 INFO server.ZooKeeperServer: Server environment:user.name=jenkins

12/11/20 23:28:32 INFO server.ZooKeeperServer: Server environment:user.home=/home/jenkins

12/11/20 23:28:32 INFO server.ZooKeeperServer: Server environment:user.dir=/tmp

12/11/20 23:28:32 INFO server.ZooKeeperServer: tickTime set to 3000

12/11/20 23:28:32 INFO server.ZooKeeperServer: minSessionTimeout set to -1

12/11/20 23:28:32 INFO server.ZooKeeperServer: maxSessionTimeout set to 1200000

12/11/20 23:28:32 INFO server.NIOServerCnxn: binding to port 0.0.0.0/0.0.0.0:20000

12/11/20 23:28:32 INFO persistence.FileSnap: Reading snapshot /tmp/hama-testzookeeper/version-2/snapshot.ed

12/11/20 23:28:32 INFO persistence.FileTxnSnapLog: Snapshotting: f2

12/11/20 23:28:42 INFO zookeeper.ZooKeeper: Client environment:zookeeper.version=3.3.3-1073969,
built on 02/23/2011 22:27 GMT

12/11/20 23:28:42 INFO zookeeper.ZooKeeper: Client environment:host.name=hemera.apache.org

12/11/20 23:28:42 INFO zookeeper.ZooKeeper: Client environment:java.version=1.6.0_32

12/11/20 23:28:42 INFO zookeeper.ZooKeeper: Client environment:java.vendor=Sun Microsystems
Inc.

12/11/20 23:28:42 INFO zookeeper.ZooKeeper: Client environment:java.home=/x1/jenkins/tools/java/jdk1.6.0_32-32/jre

12/11/20 23:28:42 INFO zookeeper.ZooKeeper: Client environment:java.class.path=/tmp/surefirebooter2435465795376947855.jar

12/11/20 23:28:42 INFO zookeeper.ZooKeeper: Client environment:java.library.path=/x1/jenkins/tools/java/jdk1.6.0_32-32/jre/lib/i386/server:/x1/jenkins/tools/java/jdk1.6.0_32-32/jre/lib/i386:/x1/jenkins/tools/java/jdk1.6.0_32-32/jre/../lib/i386:/usr/lib/jvm/java-6-openjdk-amd64/jre/lib/amd64/server:/usr/lib/jvm/java-6-openjdk-amd64/jre/lib/amd64:/usr/lib/jvm/java-6-openjdk-amd64/jre/../lib/amd64:/usr/java/packages/lib/i386:/lib:/usr/lib

12/11/20 23:28:42 INFO zookeeper.ZooKeeper: Client environment:java.io.tmpdir=/tmp

12/11/20 23:28:42 INFO zookeeper.ZooKeeper: Client environment:java.compiler=<NA>

12/11/20 23:28:42 INFO zookeeper.ZooKeeper: Client environment:os.name=Linux

12/11/20 23:28:42 INFO zookeeper.ZooKeeper: Client environment:os.arch=i386

12/11/20 23:28:42 INFO zookeeper.ZooKeeper: Client environment:os.version=3.2.0-31-generic

12/11/20 23:28:42 INFO zookeeper.ZooKeeper: Client environment:user.name=jenkins

12/11/20 23:28:42 INFO zookeeper.ZooKeeper: Client environment:user.home=/home/jenkins

12/11/20 23:28:42 INFO zookeeper.ZooKeeper: Client environment:user.dir=/tmp

12/11/20 23:28:42 INFO zookeeper.ZooKeeper: Initiating client connection, connectString=localhost:20000
sessionTimeout=1200000 watcher=org.apache.hama.bsp.sync.ZKSyncBSPMasterClient@1b4a74b

12/11/20 23:28:42 INFO zookeeper.ClientCnxn: Opening socket connection to server localhost/0:0:0:0:0:0:0:1:20000

12/11/20 23:28:42 INFO sync.ZKSyncBSPMasterClient: Initialized ZK false

12/11/20 23:28:42 INFO sync.ZKSyncClient: Initializing ZK Sync Client

12/11/20 23:28:42 INFO zookeeper.ClientCnxn: Socket connection established to localhost/0:0:0:0:0:0:0:1:20000,
initiating session

12/11/20 23:28:42 INFO server.NIOServerCnxn: Accepted socket connection from /0:0:0:0:0:0:0:1:45179

12/11/20 23:28:42 INFO server.NIOServerCnxn: Client attempting to establish new session at
/0:0:0:0:0:0:0:1:45179

12/11/20 23:28:42 INFO persistence.FileTxnLog: Creating new log file: log.f3

12/11/20 23:28:42 INFO server.NIOServerCnxn: Established session 0x13b2026cee60000 with negotiated
timeout 1200000 for client /0:0:0:0:0:0:0:1:45179

12/11/20 23:28:42 INFO zookeeper.ClientCnxn: Session establishment complete on server localhost/0:0:0:0:0:0:0:1:20000,
sessionid = 0x13b2026cee60000, negotiated timeout = 1200000

12/11/20 23:28:42 INFO mortbay.log: Logging to org.slf4j.impl.Log4jLoggerAdapter(org.mortbay.log)
via org.mortbay.log.Slf4jLog

12/11/20 23:28:42 INFO mortbay.log: Created master and client sync clients

12/11/20 23:28:42 INFO mortbay.log: BSP root exists

12/11/20 23:28:42 INFO zookeeper.ZooKeeper: Initiating client connection, connectString=localhost:20000
sessionTimeout=1200000 watcher=org.apache.hama.bsp.sync.ZooKeeperSyncClientImpl@3257b8

12/11/20 23:28:42 INFO zookeeper.ClientCnxn: Opening socket connection to server localhost/0:0:0:0:0:0:0:1:20000

12/11/20 23:28:42 INFO sync.ZKSyncClient: Initializing ZK Sync Client

12/11/20 23:28:42 INFO zookeeper.ClientCnxn: Socket connection established to localhost/0:0:0:0:0:0:0:1:20000,
initiating session

12/11/20 23:28:42 INFO sync.ZooKeeperSyncClientImpl: Start connecting to Zookeeper! At /0.0.0.0:21815

12/11/20 23:28:42 INFO server.NIOServerCnxn: Accepted socket connection from /0:0:0:0:0:0:0:1:45180

12/11/20 23:28:42 INFO server.NIOServerCnxn: Client attempting to establish new session at
/0:0:0:0:0:0:0:1:45180

12/11/20 23:28:42 INFO server.NIOServerCnxn: Established session 0x13b2026cee60001 with negotiated
timeout 1200000 for client /0:0:0:0:0:0:0:1:45180

12/11/20 23:28:42 INFO zookeeper.ClientCnxn: Session establishment complete on server localhost/0:0:0:0:0:0:0:1:20000,
sessionid = 0x13b2026cee60001, negotiated timeout = 1200000

12/11/20 23:28:42 INFO sync.ZKSyncClient: Writing data /bsp/job_test1_0001/info/level2

12/11/20 23:28:42 INFO mortbay.log: Found child count = 2

12/11/20 23:28:42 INFO mortbay.log: Passed the child count test

12/11/20 23:28:42 INFO mortbay.log: Found child count = 2

12/11/20 23:28:42 INFO mortbay.log:  Peer name 2

12/11/20 23:28:42 INFO mortbay.log:  Peer name 1

12/11/20 23:28:42 INFO mortbay.log: Passed the child key set test

12/11/20 23:28:42 INFO mortbay.log: /bsp/job_test1_0001

12/11/20 23:28:42 INFO mortbay.log: Passed the key presence test

12/11/20 23:28:42 INFO sync.ZKSyncClient: Writing data /bsp/job_test1_0001/info/level3

12/11/20 23:28:42 INFO mortbay.log: Passed array writable test

12/11/20 23:28:42 INFO server.NIOServerCnxn: Closed socket connection for client /0:0:0:0:0:0:0:1:45180
which had sessionid 0x13b2026cee60001

12/11/20 23:28:42 INFO zookeeper.ClientCnxn: Unable to read additional data from server sessionid
0x13b2026cee60001, likely server has closed socket, closing socket connection and attempting
reconnect

12/11/20 23:28:42 INFO server.NIOServerCnxn: Closed socket connection for client /0:0:0:0:0:0:0:1:45179
which had sessionid 0x13b2026cee60000

12/11/20 23:28:42 INFO zookeeper.ClientCnxn: Unable to read additional data from server sessionid
0x13b2026cee60000, likely server has closed socket, closing socket connection and attempting
reconnect

12/11/20 23:28:42 INFO server.NIOServerCnxn: NIOServerCnxn factory exited run method

12/11/20 23:28:42 INFO server.PrepRequestProcessor: PrepRequestProcessor exited loop!

12/11/20 23:28:42 INFO server.SyncRequestProcessor: SyncRequestProcessor exited!

12/11/20 23:28:42 INFO server.FinalRequestProcessor: shutdown of request processor complete

12/11/20 23:28:42 INFO server.FinalRequestProcessor: shutdown of request processor complete

12/11/20 23:28:42 WARN jmx.MBeanRegistry: Failed to unregister MBean InMemoryDataTree

12/11/20 23:28:42 WARN jmx.MBeanRegistry: Error during unregister
javax.management.InstanceNotFoundException: org.apache.ZooKeeperService:name0=StandaloneServer_port-1,name1=InMemoryDataTree
	at com.sun.jmx.interceptor.DefaultMBeanServerInterceptor.getMBean(DefaultMBeanServerInterceptor.java:1094)
	at com.sun.jmx.interceptor.DefaultMBeanServerInterceptor.exclusiveUnregisterMBean(DefaultMBeanServerInterceptor.java:415)
	at com.sun.jmx.interceptor.DefaultMBeanServerInterceptor.unregisterMBean(DefaultMBeanServerInterceptor.java:403)
	at com.sun.jmx.mbeanserver.JmxMBeanServer.unregisterMBean(JmxMBeanServer.java:506)
	at org.apache.zookeeper.jmx.MBeanRegistry.unregister(MBeanRegistry.java:94)
	at org.apache.zookeeper.jmx.MBeanRegistry.unregister(MBeanRegistry.java:111)
	at org.apache.zookeeper.server.ZooKeeperServer.unregisterJMX(ZooKeeperServer.java:424)
	at org.apache.zookeeper.server.ZooKeeperServer.shutdown(ZooKeeperServer.java:417)
	at org.apache.zookeeper.server.NIOServerCnxn$Factory.shutdown(NIOServerCnxn.java:324)
	at org.apache.zookeeper.server.ZooKeeperServerMain.shutdown(ZooKeeperServerMain.java:125)
	at org.apache.hama.zookeeper.QuorumPeer$ShutdownableZooKeeperServerMain.shutdown(QuorumPeer.java:407)
	at org.apache.hama.zookeeper.QuorumPeer$ShutdownableZooKeeperServerMain.shutdownZookeeperMain(QuorumPeer.java:402)
	at org.apache.hama.bsp.sync.ZooKeeperSyncServerImpl.stopServer(ZooKeeperSyncServerImpl.java:89)
	at org.apache.hama.bsp.TestZooKeeper.testClearZKNodes(TestZooKeeper.java:187)
	at sun.reflect.NativeMethodAccessorImpl.invoke0(Native Method)
	at sun.reflect.NativeMethodAccessorImpl.invoke(NativeMethodAccessorImpl.java:39)
	at sun.reflect.DelegatingMethodAccessorImpl.invoke(DelegatingMethodAccessorImpl.java:25)
	at java.lang.reflect.Method.invoke(Method.java:597)
	at junit.framework.TestCase.runTest(TestCase.java:168)
	at junit.framework.TestCase.runBare(TestCase.java:134)
	at junit.framework.TestResult$1.protect(TestResult.java:110)
	at junit.framework.TestResult.runProtected(TestResult.java:128)
	at junit.framework.TestResult.run(TestResult.java:113)
	at junit.framework.TestCase.run(TestCase.java:124)
	at junit.framework.TestSuite.runTest(TestSuite.java:232)
	at junit.framework.TestSuite.run(TestSuite.java:227)
	at org.junit.internal.runners.JUnit38ClassRunner.run(JUnit38ClassRunner.java:83)
	at org.junit.runners.Suite.runChild(Suite.java:128)
	at org.junit.runners.Suite.runChild(Suite.java:24)
	at org.junit.runners.ParentRunner$3.run(ParentRunner.java:193)
	at org.junit.runners.ParentRunner$1.schedule(ParentRunner.java:52)
	at org.junit.runners.ParentRunner.runChildren(ParentRunner.java:191)
	at org.junit.runners.ParentRunner.access$000(ParentRunner.java:42)
	at org.junit.runners.ParentRunner$2.evaluate(ParentRunner.java:184)
	at org.junit.runners.ParentRunner.run(ParentRunner.java:236)
	at org.junit.runner.JUnitCore.run(JUnitCore.java:157)
	at org.junit.runner.JUnitCore.run(JUnitCore.java:136)
	at org.junit.runner.JUnitCore.run(JUnitCore.java:127)
	at org.apache.maven.surefire.junitcore.JUnitCoreTestSet.runJunitCore(JUnitCoreTestSet.java:208)
	at org.apache.maven.surefire.junitcore.JUnitCoreTestSet.execute(JUnitCoreTestSet.java:95)
	at org.apache.maven.surefire.junitcore.JUnitCoreTestSet.execute(JUnitCoreTestSet.java:82)
	at org.apache.maven.surefire.junitcore.JUnitCoreDirectoryTestSuite.execute(JUnitCoreDirectoryTestSuite.java:84)
	at org.apache.maven.surefire.Surefire.run(Surefire.java:104)
	at sun.reflect.NativeMethodAccessorImpl.invoke0(Native Method)
	at sun.reflect.NativeMethodAccessorImpl.invoke(NativeMethodAccessorImpl.java:39)
	at sun.reflect.DelegatingMethodAccessorImpl.invoke(DelegatingMethodAccessorImpl.java:25)
	at java.lang.reflect.Method.invoke(Method.java:597)
	at org.apache.maven.surefire.booter.SurefireBooter.runSuitesInProcess(SurefireBooter.java:290)
	at org.apache.maven.surefire.booter.SurefireBooter.main(SurefireBooter.java:1017)

Tests run: 1, Failures: 0, Errors: 0, Skipped: 0, Time elapsed: 0.018 sec
Running org.apache.hama.zookeeper.TestZKTools
Tests run: 1, Failures: 0, Errors: 0, Skipped: 0, Time elapsed: 0.013 sec
Running org.apache.hama.bsp.message.TestAvroMessageManager
12/11/20 23:28:44 INFO ipc.NettyTransceiver: Connecting to hemera.apache.org/140.211.11.27:14000

12/11/20 23:28:45 INFO ipc.NettyTransceiver: [id: 0x0147358f] OPEN

12/11/20 23:28:45 INFO ipc.NettyServer: [id: 0x018e4327, /140.211.11.27:57326 => /140.211.11.27:14000]
OPEN

12/11/20 23:28:45 INFO ipc.NettyServer: [id: 0x018e4327, /140.211.11.27:57326 => /140.211.11.27:14000]
BOUND: /140.211.11.27:14000

12/11/20 23:28:45 INFO ipc.NettyServer: [id: 0x018e4327, /140.211.11.27:57326 => /140.211.11.27:14000]
CONNECTED: /140.211.11.27:57326

12/11/20 23:28:45 INFO ipc.NettyTransceiver: [id: 0x0147358f, /140.211.11.27:57326 => hemera.apache.org/140.211.11.27:14000]
BOUND: /140.211.11.27:57326

12/11/20 23:28:45 INFO ipc.NettyTransceiver: [id: 0x0147358f, /140.211.11.27:57326 => hemera.apache.org/140.211.11.27:14000]
CONNECTED: hemera.apache.org/140.211.11.27:14000

12/11/20 23:28:45 INFO ipc.NettyTransceiver: [id: 0x0147358f, /140.211.11.27:57326 => hemera.apache.org/140.211.11.27:14000]
INTEREST_CHANGED

12/11/20 23:28:45 INFO ipc.NettyTransceiver: [id: 0x0147358f, /140.211.11.27:57326 => hemera.apache.org/140.211.11.27:14000]
INTEREST_CHANGED

Tests run: 1, Failures: 0, Errors: 0, Skipped: 0, Time elapsed: 0.011 sec

Results :

Tests in error: 

Tests run: 49, Failures: 0, Errors: 1, Skipped: 0

[INFO] ------------------------------------------------------------------------
[INFO] Reactor Summary:
[INFO] 
[INFO] Apache Hama parent POM ............................ SUCCESS [4.134s]
[INFO] core .............................................. FAILURE [2:23.458s]
[INFO] graph ............................................. SKIPPED
[INFO] machine learning .................................. SKIPPED
[INFO] examples .......................................... SKIPPED
[INFO] yarn .............................................. SKIPPED
[INFO] hama-dist ......................................... SKIPPED
[INFO] ------------------------------------------------------------------------
[INFO] BUILD FAILURE
[INFO] ------------------------------------------------------------------------
[INFO] Total time: 2:28.187s
[INFO] Finished at: Tue Nov 20 23:28:45 UTC 2012
[INFO] Final Memory: 28M/140M
[INFO] ------------------------------------------------------------------------
[ERROR] Failed to execute goal org.apache.maven.plugins:maven-surefire-plugin:2.6:test (default-test)
on project hama-core: There are test failures.
[ERROR] 
[ERROR] Please refer to /x1/jenkins/jenkins-slave/workspace/Hama-Nightly/trunk/core/target/surefire-reports
for the individual test results.
[ERROR] -> [Help 1]
[ERROR] 
[ERROR] To see the full stack trace of the errors, re-run Maven with the -e switch.
[ERROR] Re-run Maven using the -X switch to enable full debug logging.
[ERROR] 
[ERROR] For more information about the errors and possible solutions, please read the following
articles:
[ERROR] [Help 1] http://cwiki.apache.org/confluence/display/MAVEN/MojoFailureException
[ERROR] 
[ERROR] After correcting the problems, you can resume the build with the command
[ERROR]   mvn <goals> -rf :hama-core
Build step 'Invoke top-level Maven targets' marked build as failure
Archiving artifacts
Recording test results

Mime
View raw message