hama-dev mailing list archives

Site index · List index
Message view « Date » · « Thread »
Top « Date » · « Thread »
From Apache Jenkins Server <jenk...@builds.apache.org>
Subject Build failed in Jenkins: Hama-Nightly #703
Date Thu, 11 Oct 2012 23:33:50 GMT
See <https://builds.apache.org/job/Hama-Nightly/703/>

------------------------------------------
[...truncated 2703 lines...]
12/10/11 23:33:33 INFO bsp.BSPJobClient: Counters: 7

12/10/11 23:33:33 INFO bsp.BSPJobClient:   org.apache.hama.bsp.JobInProgress$JobCounter

12/10/11 23:33:33 INFO bsp.BSPJobClient:     LAUNCHED_TASKS=2

12/10/11 23:33:33 INFO bsp.BSPJobClient:   org.apache.hama.bsp.BSPPeerImpl$PeerCounter

12/10/11 23:33:33 INFO bsp.BSPJobClient:     SUPERSTEPS=14

12/10/11 23:33:33 INFO bsp.BSPJobClient:     SUPERSTEP_SUM=30

12/10/11 23:33:33 INFO bsp.BSPJobClient:     TIME_IN_SYNC_MS=3

12/10/11 23:33:33 INFO bsp.BSPJobClient:     TOTAL_MESSAGES_SENT=120

12/10/11 23:33:33 INFO bsp.BSPJobClient:     TOTAL_MESSAGES_RECEIVED=60

12/10/11 23:33:33 INFO bsp.BSPJobClient:     TASK_OUTPUT_RECORDS=60

Tests run: 1, Failures: 0, Errors: 0, Skipped: 0, Time elapsed: 0.008 sec
Running org.apache.hama.monitor.TestConfigurator
12/10/11 23:33:34 INFO monitor.TestConfigurator: Plugins dir is not created, returned tasks
should be null -> null

Tests run: 1, Failures: 0, Errors: 0, Skipped: 0, Time elapsed: 0.01 sec
Running org.apache.hama.zookeeper.TestZKTools
Tests run: 1, Failures: 0, Errors: 0, Skipped: 0, Time elapsed: 0.011 sec
Running org.apache.hama.bsp.TestZooKeeper
12/10/11 23:33:35 ERROR quorum.QuorumPeerConfig: Invalid configuration, only one server specified
(ignoring)

12/10/11 23:33:35 INFO server.ZooKeeperServerMain: Starting server

12/10/11 23:33:35 INFO server.ZooKeeperServer: Server environment:zookeeper.version=3.3.3-1073969,
built on 02/23/2011 22:27 GMT

12/10/11 23:33:35 INFO server.ZooKeeperServer: Server environment:host.name=janus.apache.org

12/10/11 23:33:35 INFO server.ZooKeeperServer: Server environment:java.version=1.6.0_27

12/10/11 23:33:35 INFO server.ZooKeeperServer: Server environment:java.vendor=Sun Microsystems
Inc.

12/10/11 23:33:35 INFO server.ZooKeeperServer: Server environment:java.home=/home/jenkins/tools/java/jdk1.6.0_27-32/jre

12/10/11 23:33:35 INFO server.ZooKeeperServer: Server environment:java.class.path=/tmp/surefirebooter5885340785059258917.jar

12/10/11 23:33:35 INFO server.ZooKeeperServer: Server environment:java.library.path=/home/jenkins/tools/java/jdk1.6.0_27-32/jre/lib/i386/server:/home/jenkins/tools/java/jdk1.6.0_27-32/jre/lib/i386:/home/jenkins/tools/java/jdk1.6.0_27-32/jre/../lib/i386:/usr/lib/jvm/java-6-openjdk-amd64/jre/lib/amd64/server:/usr/lib/jvm/java-6-openjdk-amd64/jre/lib/amd64:/usr/lib/jvm/java-6-openjdk-amd64/jre/../lib/amd64:/usr/java/packages/lib/i386:/lib:/usr/lib

12/10/11 23:33:35 INFO server.ZooKeeperServer: Server environment:java.io.tmpdir=/tmp

12/10/11 23:33:35 INFO server.ZooKeeperServer: Server environment:java.compiler=<NA>

12/10/11 23:33:35 INFO server.ZooKeeperServer: Server environment:os.name=Linux

12/10/11 23:33:35 INFO server.ZooKeeperServer: Server environment:os.arch=i386

12/10/11 23:33:35 INFO server.ZooKeeperServer: Server environment:os.version=3.2.0-31-generic

12/10/11 23:33:35 INFO server.ZooKeeperServer: Server environment:user.name=jenkins

12/10/11 23:33:35 INFO server.ZooKeeperServer: Server environment:user.home=/home/jenkins

12/10/11 23:33:35 INFO server.ZooKeeperServer: Server environment:user.dir=/tmp

12/10/11 23:33:35 INFO server.ZooKeeperServer: tickTime set to 3000

12/10/11 23:33:35 INFO server.ZooKeeperServer: minSessionTimeout set to -1

12/10/11 23:33:35 INFO server.ZooKeeperServer: maxSessionTimeout set to 1200000

12/10/11 23:33:35 INFO server.NIOServerCnxn: binding to port 0.0.0.0/0.0.0.0:20000

12/10/11 23:33:35 INFO persistence.FileSnap: Reading snapshot /tmp/hama-testzookeeper/version-2/snapshot.21

12/10/11 23:33:35 INFO persistence.FileTxnSnapLog: Snapshotting: 25

12/10/11 23:33:36 INFO zookeeper.ZooKeeper: Client environment:zookeeper.version=3.3.3-1073969,
built on 02/23/2011 22:27 GMT

12/10/11 23:33:36 INFO zookeeper.ZooKeeper: Client environment:host.name=janus.apache.org

12/10/11 23:33:36 INFO zookeeper.ZooKeeper: Client environment:java.version=1.6.0_27

12/10/11 23:33:36 INFO zookeeper.ZooKeeper: Client environment:java.vendor=Sun Microsystems
Inc.

12/10/11 23:33:36 INFO zookeeper.ZooKeeper: Client environment:java.home=/home/jenkins/tools/java/jdk1.6.0_27-32/jre

12/10/11 23:33:36 INFO zookeeper.ZooKeeper: Client environment:java.class.path=/tmp/surefirebooter5885340785059258917.jar

12/10/11 23:33:36 INFO zookeeper.ZooKeeper: Client environment:java.library.path=/home/jenkins/tools/java/jdk1.6.0_27-32/jre/lib/i386/server:/home/jenkins/tools/java/jdk1.6.0_27-32/jre/lib/i386:/home/jenkins/tools/java/jdk1.6.0_27-32/jre/../lib/i386:/usr/lib/jvm/java-6-openjdk-amd64/jre/lib/amd64/server:/usr/lib/jvm/java-6-openjdk-amd64/jre/lib/amd64:/usr/lib/jvm/java-6-openjdk-amd64/jre/../lib/amd64:/usr/java/packages/lib/i386:/lib:/usr/lib

12/10/11 23:33:36 INFO zookeeper.ZooKeeper: Client environment:java.io.tmpdir=/tmp

12/10/11 23:33:36 INFO zookeeper.ZooKeeper: Client environment:java.compiler=<NA>

12/10/11 23:33:36 INFO zookeeper.ZooKeeper: Client environment:os.name=Linux

12/10/11 23:33:36 INFO zookeeper.ZooKeeper: Client environment:os.arch=i386

12/10/11 23:33:36 INFO zookeeper.ZooKeeper: Client environment:os.version=3.2.0-31-generic

12/10/11 23:33:36 INFO zookeeper.ZooKeeper: Client environment:user.name=jenkins

12/10/11 23:33:36 INFO zookeeper.ZooKeeper: Client environment:user.home=/home/jenkins

12/10/11 23:33:36 INFO zookeeper.ZooKeeper: Client environment:user.dir=/tmp

12/10/11 23:33:36 INFO zookeeper.ZooKeeper: Initiating client connection, connectString=localhost:20000
sessionTimeout=1200000 watcher=org.apache.hama.bsp.sync.ZKSyncBSPMasterClient@10b9279

12/10/11 23:33:36 INFO zookeeper.ClientCnxn: Opening socket connection to server localhost/127.0.0.1:20000

12/10/11 23:33:36 INFO sync.ZKSyncBSPMasterClient: Initialized ZK false

12/10/11 23:33:36 INFO sync.ZKSyncClient: Initializing ZK Sync Client

12/10/11 23:33:36 INFO zookeeper.ClientCnxn: Socket connection established to localhost/127.0.0.1:20000,
initiating session

12/10/11 23:33:36 INFO server.NIOServerCnxn: Accepted socket connection from /127.0.0.1:55497

12/10/11 23:33:36 INFO server.NIOServerCnxn: Client attempting to establish new session at
/127.0.0.1:55497

12/10/11 23:33:36 INFO persistence.FileTxnLog: Creating new log file: log.26

12/10/11 23:33:36 INFO server.NIOServerCnxn: Established session 0x13a522d0ef90000 with negotiated
timeout 1200000 for client /127.0.0.1:55497

12/10/11 23:33:36 INFO zookeeper.ClientCnxn: Session establishment complete on server localhost/127.0.0.1:20000,
sessionid = 0x13a522d0ef90000, negotiated timeout = 1200000

12/10/11 23:33:36 INFO mortbay.log: Logging to org.slf4j.impl.Log4jLoggerAdapter(org.mortbay.log)
via org.mortbay.log.Slf4jLog

12/10/11 23:33:36 INFO mortbay.log: Created master and client sync clients

12/10/11 23:33:36 INFO mortbay.log: BSP root exists

12/10/11 23:33:36 INFO zookeeper.ZooKeeper: Initiating client connection, connectString=localhost:20000
sessionTimeout=1200000 watcher=org.apache.hama.bsp.sync.ZooKeeperSyncClientImpl@9cfec1

12/10/11 23:33:36 INFO zookeeper.ClientCnxn: Opening socket connection to server localhost/127.0.0.1:20000

12/10/11 23:33:36 INFO sync.ZKSyncClient: Initializing ZK Sync Client

12/10/11 23:33:36 INFO zookeeper.ClientCnxn: Socket connection established to localhost/127.0.0.1:20000,
initiating session

12/10/11 23:33:36 INFO server.NIOServerCnxn: Accepted socket connection from /127.0.0.1:55498

12/10/11 23:33:36 INFO sync.ZooKeeperSyncClientImpl: Start connecting to Zookeeper! At /0.0.0.0:21815

12/10/11 23:33:36 INFO server.NIOServerCnxn: Client attempting to establish new session at
/127.0.0.1:55498

12/10/11 23:33:36 INFO server.NIOServerCnxn: Established session 0x13a522d0ef90001 with negotiated
timeout 1200000 for client /127.0.0.1:55498

12/10/11 23:33:36 INFO zookeeper.ClientCnxn: Session establishment complete on server localhost/127.0.0.1:20000,
sessionid = 0x13a522d0ef90001, negotiated timeout = 1200000

12/10/11 23:33:36 INFO sync.ZKSyncClient: Writing data /bsp/job_test1_0001/info/level2

12/10/11 23:33:36 INFO mortbay.log: Found child count = 2

12/10/11 23:33:36 INFO mortbay.log: Passed the child count test

12/10/11 23:33:37 INFO mortbay.log: Found child count = 2

12/10/11 23:33:37 INFO mortbay.log:  Peer name 2

12/10/11 23:33:37 INFO mortbay.log:  Peer name 1

12/10/11 23:33:37 INFO mortbay.log: Passed the child key set test

12/10/11 23:33:37 INFO mortbay.log: /bsp/job_test1_0001

12/10/11 23:33:37 INFO mortbay.log: Passed the key presence test

12/10/11 23:33:37 INFO sync.ZKSyncClient: Writing data /bsp/job_test1_0001/info/level3

12/10/11 23:33:37 INFO mortbay.log: Passed array writable test

12/10/11 23:33:37 INFO server.NIOServerCnxn: Closed socket connection for client /127.0.0.1:55498
which had sessionid 0x13a522d0ef90001

12/10/11 23:33:37 INFO zookeeper.ClientCnxn: Unable to read additional data from server sessionid
0x13a522d0ef90001, likely server has closed socket, closing socket connection and attempting
reconnect

12/10/11 23:33:37 INFO server.NIOServerCnxn: Closed socket connection for client /127.0.0.1:55497
which had sessionid 0x13a522d0ef90000

12/10/11 23:33:37 INFO zookeeper.ClientCnxn: Unable to read additional data from server sessionid
0x13a522d0ef90000, likely server has closed socket, closing socket connection and attempting
reconnect

12/10/11 23:33:37 INFO server.NIOServerCnxn: NIOServerCnxn factory exited run method

12/10/11 23:33:37 INFO server.PrepRequestProcessor: PrepRequestProcessor exited loop!

12/10/11 23:33:37 INFO server.SyncRequestProcessor: SyncRequestProcessor exited!

12/10/11 23:33:37 INFO server.FinalRequestProcessor: shutdown of request processor complete

12/10/11 23:33:37 INFO server.FinalRequestProcessor: shutdown of request processor complete

Tests run: 1, Failures: 0, Errors: 0, Skipped: 0, Time elapsed: 0.011 sec
Running org.apache.hama.bsp.message.TestAvroMessageManager
12/10/11 23:33:38 INFO ipc.NettyTransceiver: Connecting to janus.apache.org/67.195.138.60:14000

12/10/11 23:33:38 INFO ipc.NettyTransceiver: [id: 0x00db23f1] OPEN

12/10/11 23:33:38 INFO ipc.NettyServer: [id: 0x016ea269, /67.195.138.60:47826 => /67.195.138.60:14000]
OPEN

12/10/11 23:33:38 INFO ipc.NettyServer: [id: 0x016ea269, /67.195.138.60:47826 => /67.195.138.60:14000]
BOUND: /67.195.138.60:14000

12/10/11 23:33:38 INFO ipc.NettyServer: [id: 0x016ea269, /67.195.138.60:47826 => /67.195.138.60:14000]
CONNECTED: /67.195.138.60:47826

12/10/11 23:33:38 INFO ipc.NettyTransceiver: [id: 0x00db23f1, /67.195.138.60:47826 => janus.apache.org/67.195.138.60:14000]
BOUND: /67.195.138.60:47826

12/10/11 23:33:38 INFO ipc.NettyTransceiver: [id: 0x00db23f1, /67.195.138.60:47826 => janus.apache.org/67.195.138.60:14000]
CONNECTED: janus.apache.org/67.195.138.60:14000

12/10/11 23:33:38 INFO ipc.NettyTransceiver: [id: 0x00db23f1, /67.195.138.60:47826 => janus.apache.org/67.195.138.60:14000]
INTEREST_CHANGED

12/10/11 23:33:38 INFO ipc.NettyTransceiver: [id: 0x00db23f1, /67.195.138.60:47826 => janus.apache.org/67.195.138.60:14000]
INTEREST_CHANGED

Tests run: 1, Failures: 0, Errors: 0, Skipped: 0, Time elapsed: 0.007 sec

Results :

Failed tests: 

Tests run: 48, Failures: 1, Errors: 0, Skipped: 0

[INFO] ------------------------------------------------------------------------
[INFO] Reactor Summary:
[INFO] 
[INFO] Apache Hama parent POM ............................ SUCCESS [4.521s]
[INFO] core .............................................. FAILURE [2:48.028s]
[INFO] graph ............................................. SKIPPED
[INFO] machine learning .................................. SKIPPED
[INFO] examples .......................................... SKIPPED
[INFO] yarn .............................................. SKIPPED
[INFO] hama-dist ......................................... SKIPPED
[INFO] ------------------------------------------------------------------------
[INFO] BUILD FAILURE
[INFO] ------------------------------------------------------------------------
[INFO] Total time: 2:58.398s
[INFO] Finished at: Thu Oct 11 23:33:39 UTC 2012
[INFO] Final Memory: 28M/164M
[INFO] ------------------------------------------------------------------------
[ERROR] Failed to execute goal org.apache.maven.plugins:maven-surefire-plugin:2.6:test (default-test)
on project hama-core: There are test failures.
[ERROR] 
[ERROR] Please refer to <https://builds.apache.org/job/Hama-Nightly/ws/trunk/core/target/surefire-reports>
for the individual test results.
[ERROR] -> [Help 1]
[ERROR] 
[ERROR] To see the full stack trace of the errors, re-run Maven with the -e switch.
[ERROR] Re-run Maven using the -X switch to enable full debug logging.
[ERROR] 
[ERROR] For more information about the errors and possible solutions, please read the following
articles:
[ERROR] [Help 1] http://cwiki.apache.org/confluence/display/MAVEN/MojoFailureException
[ERROR] 
[ERROR] After correcting the problems, you can resume the build with the command
[ERROR]   mvn <goals> -rf :hama-core
Build step 'Invoke top-level Maven targets' marked build as failure
Archiving artifacts
Recording test results

Mime
View raw message