hama-dev mailing list archives

Site index · List index
Message view « Date » · « Thread »
Top « Date » · « Thread »
From Apache Jenkins Server <jenk...@builds.apache.org>
Subject Build failed in Jenkins: Hama-Nightly #680
Date Wed, 19 Sep 2012 23:01:00 GMT
See <https://builds.apache.org/job/Hama-Nightly/680/changes>

Changes:

[tjungblut] [HAMA-601]: Hama Streaming

[tjungblut] [HAMA-642]: Make GraphRunner disk based

[edwardyoon] We'll use Hadoop RPC until alternative is ready.

------------------------------------------
[...truncated 4746 lines...]
114 KB   
118 KB   
122 KB   
126 KB   
130 KB   
134 KB   
138 KB   
142 KB   
146 KB   
150 KB   
154 KB   
158 KB   
162 KB   
163 KB   
166 KB   
170 KB   
174 KB   
178 KB   
182 KB   
186 KB   
190 KB   
194 KB   
198 KB   
202 KB   
206 KB   
210 KB   
214 KB   
218 KB   
222 KB   
226 KB   
230 KB   
232 KB   
         
Downloaded: http://repo1.maven.org/maven2/junit/junit/4.8.1/junit-4.8.1.jar (232 KB at 7716.4
KB/sec)
[INFO] 
[INFO] --- maven-clean-plugin:2.4.1:clean (default-clean) @ hama-jdbm ---
[INFO] Deleting /x1/jenkins/jenkins-slave/workspace/Hama-Nightly/trunk/jdbm (includes = [lib/**,
logs/**, docs/apidocs/**], excludes = [])
[INFO] 
[INFO] --- maven-remote-resources-plugin:1.1:process (default) @ hama-jdbm ---
[INFO] 
[INFO] --- maven-resources-plugin:2.4:resources (default-resources) @ hama-jdbm ---
Downloading: http://repo1.maven.org/maven2/org/codehaus/plexus/plexus-utils/1.5.15/plexus-utils-1.5.15.jar
Downloading: http://repo1.maven.org/maven2/org/apache/maven/reporting/maven-reporting-api/2.0.6/maven-reporting-api-2.0.6.jar
4 KB     
8 KB   
10 KB   
        
Downloaded: http://repo1.maven.org/maven2/org/apache/maven/reporting/maven-reporting-api/2.0.6/maven-reporting-api-2.0.6.jar
(10 KB at 571.1 KB/sec)
4 KB    
8 KB   
12 KB   
16 KB   
20 KB   
24 KB   
28 KB   
32 KB   
36 KB   
40 KB   
44 KB   
48 KB   
52 KB   
56 KB   
60 KB   
64 KB   
68 KB   
72 KB   
76 KB   
80 KB   
84 KB   
87 KB   
91 KB   
95 KB   
99 KB   
103 KB   
107 KB   
111 KB   
115 KB   
119 KB   
123 KB   
127 KB   
131 KB   
135 KB   
139 KB   
143 KB   
147 KB   
151 KB   
155 KB   
159 KB   
163 KB   
167 KB   
171 KB   
175 KB   
176 KB   
180 KB   
184 KB   
188 KB   
192 KB   
196 KB   
200 KB   
204 KB   
208 KB   
212 KB   
216 KB   
220 KB   
223 KB   
         
Downloaded: http://repo1.maven.org/maven2/org/codehaus/plexus/plexus-utils/1.5.15/plexus-utils-1.5.15.jar
(223 KB at 4842.7 KB/sec)
[INFO] Using 'UTF-8' encoding to copy filtered resources.
[INFO] Copying 0 resource
[INFO] Copying 3 resources
[INFO] 
[INFO] --- maven-compiler-plugin:2.3.2:compile (default-compile) @ hama-jdbm ---
Downloading: http://repo1.maven.org/maven2/org/codehaus/plexus/plexus-compiler-api/1.8.1/plexus-compiler-api-1.8.1.pom
805 B    
        
Downloaded: http://repo1.maven.org/maven2/org/codehaus/plexus/plexus-compiler-api/1.8.1/plexus-compiler-api-1.8.1.pom
(805 B at 20.7 KB/sec)
Downloading: http://repo1.maven.org/maven2/org/codehaus/plexus/plexus-compiler/1.8.1/plexus-compiler-1.8.1.pom
4 KB    
       
Downloaded: http://repo1.maven.org/maven2/org/codehaus/plexus/plexus-compiler/1.8.1/plexus-compiler-1.8.1.pom
(4 KB at 97.0 KB/sec)
Downloading: http://repo1.maven.org/maven2/org/codehaus/plexus/plexus-components/1.1.18/plexus-components-1.1.18.pom
4 KB   
6 KB   
       
Downloaded: http://repo1.maven.org/maven2/org/codehaus/plexus/plexus-components/1.1.18/plexus-components-1.1.18.pom
(6 KB at 326.8 KB/sec)
Downloading: http://repo1.maven.org/maven2/org/codehaus/plexus/plexus/2.0.7/plexus-2.0.7.pom
4 KB   
8 KB   
12 KB   
16 KB   
17 KB   
        
Downloaded: http://repo1.maven.org/maven2/org/codehaus/plexus/plexus/2.0.7/plexus-2.0.7.pom
(17 KB at 1055.6 KB/sec)
Downloading: http://repo1.maven.org/maven2/org/codehaus/plexus/plexus-compiler-manager/1.8.1/plexus-compiler-manager-1.8.1.pom
713 B   
        
Downloaded: http://repo1.maven.org/maven2/org/codehaus/plexus/plexus-compiler-manager/1.8.1/plexus-compiler-manager-1.8.1.pom
(713 B at 46.4 KB/sec)
Downloading: http://repo1.maven.org/maven2/org/codehaus/plexus/plexus-compiler-javac/1.8.1/plexus-compiler-javac-1.8.1.pom
710 B   
        
Downloaded: http://repo1.maven.org/maven2/org/codehaus/plexus/plexus-compiler-javac/1.8.1/plexus-compiler-javac-1.8.1.pom
(710 B at 46.2 KB/sec)
Downloading: http://repo1.maven.org/maven2/org/codehaus/plexus/plexus-compilers/1.8.1/plexus-compilers-1.8.1.pom
2 KB    
       
Downloaded: http://repo1.maven.org/maven2/org/codehaus/plexus/plexus-compilers/1.8.1/plexus-compilers-1.8.1.pom
(2 KB at 86.3 KB/sec)
Downloading: http://repo1.maven.org/maven2/org/codehaus/plexus/plexus-compiler-api/1.8.1/plexus-compiler-api-1.8.1.jar
Downloading: http://repo1.maven.org/maven2/org/codehaus/plexus/plexus-compiler-manager/1.8.1/plexus-compiler-manager-1.8.1.jar
Downloading: http://repo1.maven.org/maven2/org/codehaus/plexus/plexus-compiler-javac/1.8.1/plexus-compiler-javac-1.8.1.jar
4 KB   
4 KB   4 KB   
8 KB   4 KB   
12 KB   4 KB   
12 KB   6 KB   
16 KB   6 KB   
20 KB   6 KB   
               
Downloaded: http://repo1.maven.org/maven2/org/codehaus/plexus/plexus-compiler-manager/1.8.1/plexus-compiler-manager-1.8.1.jar
(6 KB at 325.0 KB/sec)
               
Downloaded: http://repo1.maven.org/maven2/org/codehaus/plexus/plexus-compiler-api/1.8.1/plexus-compiler-api-1.8.1.jar
(20 KB at 1146.7 KB/sec)
4 KB           
8 KB   
12 KB   
13 KB   
        
Downloaded: http://repo1.maven.org/maven2/org/codehaus/plexus/plexus-compiler-javac/1.8.1/plexus-compiler-javac-1.8.1.jar
(13 KB at 452.9 KB/sec)
[INFO] Compiling 41 source files to /x1/jenkins/jenkins-slave/workspace/Hama-Nightly/trunk/jdbm/target/classes
[INFO] 
[INFO] --- maven-resources-plugin:2.4:testResources (default-testResources) @ hama-jdbm ---
[INFO] Using 'UTF-8' encoding to copy filtered resources.
[INFO] Copying 0 resource
[INFO] Copying 3 resources
[INFO] 
[INFO] --- maven-compiler-plugin:2.3.2:testCompile (default-testCompile) @ hama-jdbm ---
[INFO] Compiling 56 source files to /x1/jenkins/jenkins-slave/workspace/Hama-Nightly/trunk/jdbm/target/test-classes
[INFO] -------------------------------------------------------------
[ERROR] COMPILATION ERROR : 
[INFO] -------------------------------------------------------------
[ERROR] /x1/jenkins/jenkins-slave/workspace/Hama-Nightly/trunk/jdbm/src/test/java/org/apache/hama/jdbm/DBTest.java:[247,20]
incompatible types; inferred type argument(s) java.lang.Object,java.lang.Object do not conform
to bounds of type variable(s) K,V
found   : <K,V>java.util.NavigableMap<K,V>
required: java.lang.Object
[ERROR] /x1/jenkins/jenkins-slave/workspace/Hama-Nightly/trunk/jdbm/src/test/java/org/apache/hama/jdbm/DBTest.java:[326,27]
incompatible types; inferred type argument(s) java.lang.Object,java.lang.Object do not conform
to bounds of type variable(s) K,V
found   : <K,V>java.util.NavigableMap<K,V>
required: java.util.Map
[ERROR] /x1/jenkins/jenkins-slave/workspace/Hama-Nightly/trunk/jdbm/src/test/java/org/apache/hama/jdbm/DBTest.java:[372,27]
incompatible types; inferred type argument(s) java.lang.Object,java.lang.Object do not conform
to bounds of type variable(s) K,V
found   : <K,V>java.util.NavigableMap<K,V>
required: java.util.Map
[ERROR] /x1/jenkins/jenkins-slave/workspace/Hama-Nightly/trunk/jdbm/src/test/java/org/apache/hama/jdbm/DBTest.java:[420,28]
incompatible types; inferred type argument(s) java.lang.Object,java.lang.Object do not conform
to bounds of type variable(s) K,V
found   : <K,V>java.util.NavigableMap<K,V>
required: java.util.Map
[ERROR] /x1/jenkins/jenkins-slave/workspace/Hama-Nightly/trunk/jdbm/src/test/java/org/apache/hama/jdbm/DefragTest.java:[60,27]
incompatible types; inferred type argument(s) java.lang.Object,java.lang.Object do not conform
to bounds of type variable(s) K,V
found   : <K,V>java.util.NavigableMap<K,V>
required: java.util.Map
[ERROR] /x1/jenkins/jenkins-slave/workspace/Hama-Nightly/trunk/jdbm/src/test/java/org/apache/hama/jdbm/DBCacheTest.java:[53,28]
incompatible types; inferred type argument(s) java.lang.Object,java.lang.Object do not conform
to bounds of type variable(s) K,V
found   : <K,V>java.util.NavigableMap<K,V>
required: java.util.Map
[INFO] 6 errors 
[INFO] -------------------------------------------------------------
[INFO] ------------------------------------------------------------------------
[INFO] Reactor Summary:
[INFO] 
[INFO] Apache Hama parent POM ............................ SUCCESS [10.477s]
[INFO] jdbm-datastructures ............................... FAILURE [3.761s]
[INFO] core .............................................. SKIPPED
[INFO] graph ............................................. SKIPPED
[INFO] machine learning .................................. SKIPPED
[INFO] examples .......................................... SKIPPED
[INFO] yarn .............................................. SKIPPED
[INFO] hama-dist ......................................... SKIPPED
[INFO] ------------------------------------------------------------------------
[INFO] BUILD FAILURE
[INFO] ------------------------------------------------------------------------
[INFO] Total time: 15.794s
[INFO] Finished at: Wed Sep 19 23:01:00 UTC 2012
[INFO] Final Memory: 18M/161M
[INFO] ------------------------------------------------------------------------
[ERROR] Failed to execute goal org.apache.maven.plugins:maven-compiler-plugin:2.3.2:testCompile
(default-testCompile) on project hama-jdbm: Compilation failure: Compilation failure:
[ERROR] /x1/jenkins/jenkins-slave/workspace/Hama-Nightly/trunk/jdbm/src/test/java/org/apache/hama/jdbm/DBTest.java:[247,20]
incompatible types; inferred type argument(s) java.lang.Object,java.lang.Object do not conform
to bounds of type variable(s) K,V
[ERROR] found   : <K,V>java.util.NavigableMap<K,V>
[ERROR] required: java.lang.Object
[ERROR] /x1/jenkins/jenkins-slave/workspace/Hama-Nightly/trunk/jdbm/src/test/java/org/apache/hama/jdbm/DBTest.java:[326,27]
incompatible types; inferred type argument(s) java.lang.Object,java.lang.Object do not conform
to bounds of type variable(s) K,V
[ERROR] found   : <K,V>java.util.NavigableMap<K,V>
[ERROR] required: java.util.Map
[ERROR] /x1/jenkins/jenkins-slave/workspace/Hama-Nightly/trunk/jdbm/src/test/java/org/apache/hama/jdbm/DBTest.java:[372,27]
incompatible types; inferred type argument(s) java.lang.Object,java.lang.Object do not conform
to bounds of type variable(s) K,V
[ERROR] found   : <K,V>java.util.NavigableMap<K,V>
[ERROR] required: java.util.Map
[ERROR] /x1/jenkins/jenkins-slave/workspace/Hama-Nightly/trunk/jdbm/src/test/java/org/apache/hama/jdbm/DBTest.java:[420,28]
incompatible types; inferred type argument(s) java.lang.Object,java.lang.Object do not conform
to bounds of type variable(s) K,V
[ERROR] found   : <K,V>java.util.NavigableMap<K,V>
[ERROR] required: java.util.Map
[ERROR] /x1/jenkins/jenkins-slave/workspace/Hama-Nightly/trunk/jdbm/src/test/java/org/apache/hama/jdbm/DefragTest.java:[60,27]
incompatible types; inferred type argument(s) java.lang.Object,java.lang.Object do not conform
to bounds of type variable(s) K,V
[ERROR] found   : <K,V>java.util.NavigableMap<K,V>
[ERROR] required: java.util.Map
[ERROR] /x1/jenkins/jenkins-slave/workspace/Hama-Nightly/trunk/jdbm/src/test/java/org/apache/hama/jdbm/DBCacheTest.java:[53,28]
incompatible types; inferred type argument(s) java.lang.Object,java.lang.Object do not conform
to bounds of type variable(s) K,V
[ERROR] found   : <K,V>java.util.NavigableMap<K,V>
[ERROR] required: java.util.Map
[ERROR] -> [Help 1]
[ERROR] 
[ERROR] To see the full stack trace of the errors, re-run Maven with the -e switch.
[ERROR] Re-run Maven using the -X switch to enable full debug logging.
[ERROR] 
[ERROR] For more information about the errors and possible solutions, please read the following
articles:
[ERROR] [Help 1] http://cwiki.apache.org/confluence/display/MAVEN/MojoFailureException
[ERROR] 
[ERROR] After correcting the problems, you can resume the build with the command
[ERROR]   mvn <goals> -rf :hama-jdbm
Build step 'Invoke top-level Maven targets' marked build as failure
Archiving artifacts
Recording test results
Updating HAMA-642
Updating HAMA-601

Mime
View raw message