hama-dev mailing list archives

Site index · List index
Message view « Date » · « Thread »
Top « Date » · « Thread »
From Apache Jenkins Server <jenk...@builds.apache.org>
Subject Build failed in Jenkins: Hama-Nightly #616
Date Thu, 19 Jul 2012 23:04:16 GMT
See <https://builds.apache.org/job/Hama-Nightly/616/>

------------------------------------------
[...truncated 1686 lines...]
12/07/19 23:03:56 INFO bsp.TestCheckpoint: Is Ready = false at step 1

12/07/19 23:03:56 INFO bsp.TestCheckpoint: Is Ready = false at step 2

12/07/19 23:03:56 INFO bsp.TestCheckpoint: Is Ready = true at step 3

12/07/19 23:03:56 INFO bsp.TestCheckpoint: Is Ready = false at step 4

12/07/19 23:03:56 INFO bsp.TestCheckpoint: Is Ready = false at step 5

12/07/19 23:03:58 INFO ipc.Server: Stopping server on 5000

12/07/19 23:03:58 INFO ipc.Server: Stopping IPC Server listener on 5000

12/07/19 23:03:58 INFO ipc.Server: IPC Server handler 0 on 5000: exiting

12/07/19 23:03:58 INFO metrics.RpcInstrumentation: shut down

12/07/19 23:03:58 INFO ipc.Server: Stopping IPC Server Responder

Tests run: 2, Failures: 0, Errors: 0, Skipped: 0, Time elapsed: 0.012 sec
Running org.apache.hama.bsp.TestMessages
Tests run: 1, Failures: 0, Errors: 0, Skipped: 0, Time elapsed: 0.007 sec
Running org.apache.hama.bsp.message.TestHadoopMessageManager
12/07/19 23:04:02 INFO ipc.Server: Starting SocketReader

12/07/19 23:04:02 INFO ipc.Server: IPC Server Responder: starting

12/07/19 23:04:02 INFO ipc.Server: IPC Server listener on 14001: starting

12/07/19 23:04:02 INFO message.HadoopMessageManagerImpl:  BSPPeer address:hemera.apache.org
port:14001

12/07/19 23:04:02 INFO ipc.Server: IPC Server handler 0 on 14001: starting

12/07/19 23:04:02 INFO ipc.Server: Stopping server on 14001

12/07/19 23:04:02 INFO metrics.RpcInstrumentation: shut down

12/07/19 23:04:02 INFO ipc.Server: IPC Server handler 0 on 14001: exiting

12/07/19 23:04:02 INFO ipc.Server: Stopping IPC Server listener on 14001

12/07/19 23:04:02 INFO ipc.Server: Stopping IPC Server Responder

12/07/19 23:04:02 INFO ipc.Server: Starting SocketReader

12/07/19 23:04:02 INFO ipc.Server: IPC Server Responder: starting

12/07/19 23:04:02 INFO ipc.Server: IPC Server listener on 14002: starting

12/07/19 23:04:02 INFO message.HadoopMessageManagerImpl:  BSPPeer address:hemera.apache.org
port:14002

12/07/19 23:04:02 INFO ipc.Server: IPC Server handler 0 on 14002: starting

12/07/19 23:04:02 INFO ipc.Server: Stopping server on 14002

12/07/19 23:04:02 INFO metrics.RpcInstrumentation: shut down

12/07/19 23:04:02 INFO ipc.Server: Stopping IPC Server Responder

12/07/19 23:04:02 INFO ipc.Server: Stopping IPC Server listener on 14002

12/07/19 23:04:02 INFO ipc.Server: IPC Server handler 0 on 14002: exiting

Tests run: 2, Failures: 0, Errors: 0, Skipped: 0, Time elapsed: 0.007 sec
Running org.apache.hama.monitor.fd.TestFD
Running org.apache.hama.bsp.TestLocalRunner
12/07/19 23:04:03 WARN util.NativeCodeLoader: Unable to load native-hadoop library for your
platform... using builtin-java classes where applicable

12/07/19 23:04:03 WARN bsp.BSPJobClient: No job jar file set.  User classes may not be found.
See BSPJob#setJar(String) or check Your jar file.

12/07/19 23:04:03 INFO bsp.BSPJobClient: Running job: job_localrunner_0001

12/07/19 23:04:03 INFO bsp.LocalBSPRunner: Setting up a new barrier for 2 tasks!

12/07/19 23:04:06 INFO bsp.BSPJobClient: Current supersteps number: 14

12/07/19 23:04:06 INFO bsp.BSPJobClient: The total number of supersteps: 14

12/07/19 23:04:06 INFO bsp.BSPJobClient: Counters: 7

12/07/19 23:04:06 INFO bsp.BSPJobClient:   org.apache.hama.bsp.JobInProgress$JobCounter

12/07/19 23:04:06 INFO bsp.BSPJobClient:     LAUNCHED_TASKS=2

12/07/19 23:04:06 INFO bsp.BSPJobClient:   org.apache.hama.bsp.BSPPeerImpl$PeerCounter

12/07/19 23:04:06 INFO bsp.BSPJobClient:     SUPERSTEPS=14

12/07/19 23:04:06 INFO bsp.BSPJobClient:     SUPERSTEP_SUM=30

12/07/19 23:04:06 INFO bsp.BSPJobClient:     TIME_IN_SYNC_MS=9

12/07/19 23:04:06 INFO bsp.BSPJobClient:     TOTAL_MESSAGES_SENT=120

12/07/19 23:04:06 INFO bsp.BSPJobClient:     TOTAL_MESSAGES_RECEIVED=60

12/07/19 23:04:06 INFO bsp.BSPJobClient:     TASK_OUTPUT_RECORDS=60

Tests run: 1, Failures: 0, Errors: 0, Skipped: 0, Time elapsed: 0.01 sec
Running org.apache.hama.monitor.TestConfigurator
12/07/19 23:04:07 INFO monitor.TestConfigurator: Plugins dir is not created, returned tasks
should be null -> null

Tests run: 1, Failures: 0, Errors: 0, Skipped: 0, Time elapsed: 0.006 sec
Running org.apache.hama.bsp.TestZooKeeper
12/07/19 23:04:07 INFO zookeeper.ZooKeeper: Client environment:zookeeper.version=3.3.3-1073969,
built on 02/23/2011 22:27 GMT

12/07/19 23:04:07 INFO zookeeper.ZooKeeper: Client environment:host.name=hemera.apache.org

12/07/19 23:04:07 INFO zookeeper.ZooKeeper: Client environment:java.version=1.6.0_32

12/07/19 23:04:07 INFO zookeeper.ZooKeeper: Client environment:java.vendor=Sun Microsystems
Inc.

12/07/19 23:04:07 INFO zookeeper.ZooKeeper: Client environment:java.home=/x1/jenkins/tools/java/jdk1.6.0_32-32/jre

12/07/19 23:04:07 INFO zookeeper.ZooKeeper: Client environment:java.class.path=/tmp/surefirebooter7992104443653757073.jar

12/07/19 23:04:07 INFO zookeeper.ZooKeeper: Client environment:java.library.path=/x1/jenkins/tools/java/jdk1.6.0_32-32/jre/lib/i386/server:/x1/jenkins/tools/java/jdk1.6.0_32-32/jre/lib/i386:/x1/jenkins/tools/java/jdk1.6.0_32-32/jre/../lib/i386:/usr/lib/jvm/java-6-sun-1.6.0.26/jre/lib/amd64/server:/usr/lib/jvm/java-6-sun-1.6.0.26/jre/lib/amd64:/usr/lib/jvm/java-6-sun-1.6.0.26/jre/../lib/amd64:/usr/java/packages/lib/i386:/lib:/usr/lib

12/07/19 23:04:07 INFO zookeeper.ZooKeeper: Client environment:java.io.tmpdir=/tmp

12/07/19 23:04:07 INFO zookeeper.ZooKeeper: Client environment:java.compiler=<NA>

12/07/19 23:04:07 INFO zookeeper.ZooKeeper: Client environment:os.name=Linux

12/07/19 23:04:07 INFO zookeeper.ZooKeeper: Client environment:os.arch=i386

12/07/19 23:04:07 INFO zookeeper.ZooKeeper: Client environment:os.version=2.6.32-41-server

12/07/19 23:04:07 INFO zookeeper.ZooKeeper: Client environment:user.name=jenkins

12/07/19 23:04:07 INFO zookeeper.ZooKeeper: Client environment:user.home=/home/jenkins

12/07/19 23:04:07 INFO zookeeper.ZooKeeper: Client environment:user.dir=/x1/jenkins/jenkins-slave/workspace/Hama-Nightly/trunk/core

12/07/19 23:04:07 INFO zookeeper.ZooKeeper: Initiating client connection, connectString=localhost:20000
sessionTimeout=6000 watcher=null

12/07/19 23:04:07 INFO zookeeper.ClientCnxn: Opening socket connection to server localhost/127.0.0.1:20000

12/07/19 23:04:07 WARN zookeeper.ClientCnxn: Session 0x0 for server null, unexpected error,
closing socket connection and attempting reconnect
java.net.ConnectException: Connection refused
	at sun.nio.ch.SocketChannelImpl.checkConnect(Native Method)
	at sun.nio.ch.SocketChannelImpl.finishConnect(SocketChannelImpl.java:599)
	at org.apache.zookeeper.ClientCnxn$SendThread.run(ClientCnxn.java:1119)

org.apache.zookeeper.KeeperException$ConnectionLossException: KeeperErrorCode = ConnectionLoss
for /
	at org.apache.zookeeper.KeeperException.create(KeeperException.java:90)
	at org.apache.zookeeper.KeeperException.create(KeeperException.java:42)
	at org.apache.zookeeper.ZooKeeper.exists(ZooKeeper.java:809)
	at org.apache.zookeeper.ZooKeeper.exists(ZooKeeper.java:837)
	at org.apache.hama.bsp.TestZooKeeper.testClearZKNodes(TestZooKeeper.java:82)
	at sun.reflect.NativeMethodAccessorImpl.invoke0(Native Method)
	at sun.reflect.NativeMethodAccessorImpl.invoke(NativeMethodAccessorImpl.java:39)
	at sun.reflect.DelegatingMethodAccessorImpl.invoke(DelegatingMethodAccessorImpl.java:25)
	at java.lang.reflect.Method.invoke(Method.java:597)
	at junit.framework.TestCase.runTest(TestCase.java:168)
	at junit.framework.TestCase.runBare(TestCase.java:134)
	at junit.framework.TestResult$1.protect(TestResult.java:110)
	at junit.framework.TestResult.runProtected(TestResult.java:128)
	at junit.framework.TestResult.run(TestResult.java:113)
	at junit.framework.TestCase.run(TestCase.java:124)
	at junit.framework.TestSuite.runTest(TestSuite.java:232)
	at junit.framework.TestSuite.run(TestSuite.java:227)
	at org.junit.internal.runners.JUnit38ClassRunner.run(JUnit38ClassRunner.java:83)
	at org.junit.runners.Suite.runChild(Suite.java:128)
	at org.junit.runners.Suite.runChild(Suite.java:24)
	at org.junit.runners.ParentRunner$3.run(ParentRunner.java:193)
	at org.junit.runners.ParentRunner$1.schedule(ParentRunner.java:52)
	at org.junit.runners.ParentRunner.runChildren(ParentRunner.java:191)
	at org.junit.runners.ParentRunner.access$000(ParentRunner.java:42)
	at org.junit.runners.ParentRunner$2.evaluate(ParentRunner.java:184)
	at org.junit.runners.ParentRunner.run(ParentRunner.java:236)
	at org.junit.runner.JUnitCore.run(JUnitCore.java:157)
	at org.junit.runner.JUnitCore.run(JUnitCore.java:136)
	at org.junit.runner.JUnitCore.run(JUnitCore.java:127)
	at org.apache.maven.surefire.junitcore.JUnitCoreTestSet.runJunitCore(JUnitCoreTestSet.java:208)
	at org.apache.maven.surefire.junitcore.JUnitCoreTestSet.execute(JUnitCoreTestSet.java:95)
	at org.apache.maven.surefire.junitcore.JUnitCoreTestSet.execute(JUnitCoreTestSet.java:82)
	at org.apache.maven.surefire.junitcore.JUnitCoreDirectoryTestSuite.execute(JUnitCoreDirectoryTestSuite.java:84)
	at org.apache.maven.surefire.Surefire.run(Surefire.java:104)
	at sun.reflect.NativeMethodAccessorImpl.invoke0(Native Method)
	at sun.reflect.NativeMethodAccessorImpl.invoke(NativeMethodAccessorImpl.java:39)
	at sun.reflect.DelegatingMethodAccessorImpl.invoke(DelegatingMethodAccessorImpl.java:25)
	at java.lang.reflect.Method.invoke(Method.java:597)
	at org.apache.maven.surefire.booter.SurefireBooter.runSuitesInProcess(SurefireBooter.java:290)
	at org.apache.maven.surefire.booter.SurefireBooter.main(SurefireBooter.java:1017)
Tests run: 1, Failures: 0, Errors: 0, Skipped: 0, Time elapsed: 0.009 sec
Running org.apache.hama.zookeeper.TestZKTools
Tests run: 1, Failures: 0, Errors: 0, Skipped: 0, Time elapsed: 0.013 sec
Running org.apache.hama.bsp.message.TestAvroMessageManager
12/07/19 23:04:09 INFO ipc.NettyTransceiver: Connecting to hemera.apache.org/140.211.11.27:14000

12/07/19 23:04:09 INFO ipc.NettyTransceiver: [id: 0x01236cd5] OPEN

12/07/19 23:04:09 INFO ipc.NettyServer: [id: 0x002f729e, /140.211.11.27:38791 => /140.211.11.27:14000]
OPEN

12/07/19 23:04:09 INFO ipc.NettyServer: [id: 0x002f729e, /140.211.11.27:38791 => /140.211.11.27:14000]
BOUND: /140.211.11.27:14000

12/07/19 23:04:09 INFO ipc.NettyServer: [id: 0x002f729e, /140.211.11.27:38791 => /140.211.11.27:14000]
CONNECTED: /140.211.11.27:38791

12/07/19 23:04:09 INFO ipc.NettyTransceiver: [id: 0x01236cd5, /140.211.11.27:38791 => hemera.apache.org/140.211.11.27:14000]
BOUND: /140.211.11.27:38791

12/07/19 23:04:09 INFO ipc.NettyTransceiver: [id: 0x01236cd5, /140.211.11.27:38791 => hemera.apache.org/140.211.11.27:14000]
CONNECTED: hemera.apache.org/140.211.11.27:14000

12/07/19 23:04:09 INFO ipc.NettyTransceiver: [id: 0x01236cd5, /140.211.11.27:38791 => hemera.apache.org/140.211.11.27:14000]
INTEREST_CHANGED

12/07/19 23:04:09 INFO ipc.NettyTransceiver: [id: 0x01236cd5, /140.211.11.27:38791 => hemera.apache.org/140.211.11.27:14000]
INTEREST_CHANGED

Tests run: 1, Failures: 0, Errors: 0, Skipped: 0, Time elapsed: 0.011 sec

Results :

Failed tests: 

Tests run: 44, Failures: 1, Errors: 0, Skipped: 0

[INFO] ------------------------------------------------------------------------
[INFO] Reactor Summary:
[INFO] 
[INFO] Apache Hama parent POM ............................ SUCCESS [2.620s]
[INFO] core .............................................. FAILURE [3:04.903s]
[INFO] graph ............................................. SKIPPED
[INFO] examples .......................................... SKIPPED
[INFO] yarn .............................................. SKIPPED
[INFO] machine learning .................................. SKIPPED
[INFO] hama-dist ......................................... SKIPPED
[INFO] ------------------------------------------------------------------------
[INFO] BUILD FAILURE
[INFO] ------------------------------------------------------------------------
[INFO] Total time: 3:07.927s
[INFO] Finished at: Thu Jul 19 23:04:10 UTC 2012
[INFO] Final Memory: 28M/156M
[INFO] ------------------------------------------------------------------------
[ERROR] Failed to execute goal org.apache.maven.plugins:maven-surefire-plugin:2.6:test (default-test)
on project hama-core: There are test failures.
[ERROR] 
[ERROR] Please refer to /x1/jenkins/jenkins-slave/workspace/Hama-Nightly/trunk/core/target/surefire-reports
for the individual test results.
[ERROR] -> [Help 1]
[ERROR] 
[ERROR] To see the full stack trace of the errors, re-run Maven with the -e switch.
[ERROR] Re-run Maven using the -X switch to enable full debug logging.
[ERROR] 
[ERROR] For more information about the errors and possible solutions, please read the following
articles:
[ERROR] [Help 1] http://cwiki.apache.org/confluence/display/MAVEN/MojoFailureException
[ERROR] 
[ERROR] After correcting the problems, you can resume the build with the command
[ERROR]   mvn <goals> -rf :hama-core
Build step 'Invoke top-level Maven targets' marked build as failure
Archiving artifacts
Recording test results

Mime
View raw message