hama-dev mailing list archives

Site index · List index
Message view « Date » · « Thread »
Top « Date » · « Thread »
From Apache Jenkins Server <jenk...@builds.apache.org>
Subject Build failed in Jenkins: Hama trunk #1
Date Mon, 28 May 2012 12:05:48 GMT
See <https://builds.apache.org/job/Hama%20trunk/1/>

------------------------------------------
[...truncated 113228 lines...]
12 KB   154 KB   162 KB   
12 KB   154 KB   163 KB   
12 KB   154 KB   163 KB   
12 KB   154 KB   164 KB   
12 KB   154 KB   164 KB   
12 KB   154 KB   165 KB   
12 KB   154 KB   165 KB   
12 KB   154 KB   166 KB   
12 KB   154 KB   166 KB   
12 KB   154 KB   167 KB   
12 KB   154 KB   167 KB   
12 KB   154 KB   168 KB   
12 KB   154 KB   168 KB   
12 KB   154 KB   169 KB   
12 KB   154 KB   169 KB   
12 KB   154 KB   170 KB   
12 KB   154 KB   170 KB   
12 KB   154 KB   171 KB   
12 KB   154 KB   171 KB   
12 KB   154 KB   172 KB   
12 KB   154 KB   172 KB   
12 KB   154 KB   173 KB   
12 KB   154 KB   173 KB   
12 KB   154 KB   174 KB   
12 KB   154 KB   174 KB   
12 KB   154 KB   175 KB   
12 KB   154 KB   175 KB   
12 KB   154 KB   176 KB   
12 KB   154 KB   176 KB   
12 KB   154 KB   177 KB   
12 KB   154 KB   177 KB   
12 KB   154 KB   178 KB   
12 KB   154 KB   178 KB   
12 KB   154 KB   179 KB   
12 KB   154 KB   179 KB   
12 KB   154 KB   180 KB   
12 KB   154 KB   180 KB   
12 KB   154 KB   181 KB   
12 KB   154 KB   181 KB   
12 KB   154 KB   182 KB   
12 KB   154 KB   182 KB   
12 KB   154 KB   182 KB   
12 KB   154 KB   183 KB   
12 KB   154 KB   183 KB   
12 KB   154 KB   183 KB   
12 KB   154 KB   184 KB   
12 KB   154 KB   185 KB   
12 KB   154 KB   185 KB   
12 KB   154 KB   186 KB   
12 KB   154 KB   186 KB   
12 KB   154 KB   187 KB   
12 KB   154 KB   187 KB   
12 KB   154 KB   188 KB   
12 KB   154 KB   188 KB   
12 KB   154 KB   189 KB   
12 KB   154 KB   189 KB   
12 KB   154 KB   190 KB   
12 KB   154 KB   190 KB   
12 KB   154 KB   191 KB   
12 KB   154 KB   191 KB   
12 KB   154 KB   192 KB   
12 KB   154 KB   192 KB   
12 KB   154 KB   193 KB   
12 KB   154 KB   193 KB   
12 KB   154 KB   194 KB   
12 KB   154 KB   194 KB   
12 KB   154 KB   195 KB   
12 KB   154 KB   195 KB   
12 KB   154 KB   196 KB   
12 KB   154 KB   196 KB   
12 KB   154 KB   197 KB   
12 KB   154 KB   198 KB   
12 KB   154 KB   198 KB   
12 KB   154 KB   199 KB   
12 KB   154 KB   199 KB   
12 KB   154 KB   200 KB   
12 KB   154 KB   200 KB   
12 KB   154 KB   201 KB   
12 KB   154 KB   201 KB   
12 KB   154 KB   202 KB   
12 KB   154 KB   202 KB   
12 KB   154 KB   203 KB   
12 KB   154 KB   203 KB   
12 KB   154 KB   204 KB   
12 KB   154 KB   204 KB   
12 KB   154 KB   205 KB   
12 KB   154 KB   205 KB   
12 KB   154 KB   206 KB   
12 KB   154 KB   206 KB   
12 KB   154 KB   207 KB   
12 KB   154 KB   207 KB   
12 KB   154 KB   208 KB   
12 KB   154 KB   208 KB   
12 KB   154 KB   209 KB   
12 KB   154 KB   210 KB   
12 KB   154 KB   210 KB   
12 KB   154 KB   211 KB   
12 KB   154 KB   212 KB   
12 KB   154 KB   212 KB   
12 KB   154 KB   213 KB   
12 KB   154 KB   213 KB   
12 KB   154 KB   214 KB   
12 KB   154 KB   214 KB   
12 KB   154 KB   215 KB   
12 KB   154 KB   216 KB   
12 KB   154 KB   216 KB   
12 KB   154 KB   217 KB   
12 KB   154 KB   217 KB   
12 KB   154 KB   217 KB   
12 KB   154 KB   218 KB   
12 KB   154 KB   218 KB   
12 KB   154 KB   219 KB   
12 KB   154 KB   219 KB   
12 KB   154 KB   220 KB   
12 KB   154 KB   220 KB   
12 KB   154 KB   221 KB   
12 KB   154 KB   221 KB   
12 KB   154 KB   222 KB   
12 KB   154 KB   223 KB   
12 KB   154 KB   223 KB   
12 KB   154 KB   224 KB   
12 KB   154 KB   224 KB   
12 KB   154 KB   225 KB   
12 KB   154 KB   225 KB   
12 KB   154 KB   226 KB   
12 KB   154 KB   227 KB   
12 KB   154 KB   227 KB   
12 KB   154 KB   228 KB   
12 KB   154 KB   228 KB   
12 KB   154 KB   229 KB   
12 KB   154 KB   229 KB   
12 KB   154 KB   230 KB   
12 KB   154 KB   230 KB   
12 KB   154 KB   231 KB   
12 KB   154 KB   232 KB   
12 KB   154 KB   232 KB   
12 KB   154 KB   233 KB   
12 KB   154 KB   233 KB   
12 KB   154 KB   234 KB   
12 KB   154 KB   234 KB   
12 KB   154 KB   235 KB   
12 KB   154 KB   235 KB   
12 KB   154 KB   235 KB   
12 KB   154 KB   236 KB   
12 KB   154 KB   236 KB   
12 KB   154 KB   237 KB   
12 KB   154 KB   237 KB   
12 KB   154 KB   238 KB   
12 KB   154 KB   238 KB   
12 KB   154 KB   238 KB   
12 KB   154 KB   239 KB   
12 KB   154 KB   240 KB   
12 KB   154 KB   240 KB   
12 KB   154 KB   241 KB   
12 KB   154 KB   241 KB   
12 KB   154 KB   242 KB   
12 KB   154 KB   242 KB   
12 KB   154 KB   243 KB   
12 KB   154 KB   243 KB   
12 KB   154 KB   244 KB   
12 KB   154 KB   244 KB   
12 KB   154 KB   245 KB   
12 KB   154 KB   245 KB   
12 KB   154 KB   246 KB   
12 KB   154 KB   248 KB   
12 KB   154 KB   250 KB   
12 KB   154 KB   252 KB   
12 KB   154 KB   254 KB   
12 KB   154 KB   256 KB   
12 KB   154 KB   258 KB   
12 KB   154 KB   261 KB   
12 KB   154 KB   262 KB   
                          
Downloaded: http://repo1.maven.org/maven2/org/codehaus/plexus/plexus-io/1.0-alpha-1/plexus-io-1.0-alpha-1.jar
(12 KB at 5.3 KB/sec)
                          
Downloaded: http://repo1.maven.org/maven2/org/codehaus/plexus/plexus-archiver/1.0-alpha-9/plexus-archiver-1.0-alpha-9.jar
(154 KB at 55.8 KB/sec)
                          
Downloaded: http://repo1.maven.org/maven2/org/codehaus/plexus/plexus-utils/1.5.8/plexus-utils-1.5.8.jar
(262 KB at 116.3 KB/sec)
Downloading: http://repository.apache.org/snapshots/org/apache/hama/hama-core/0.5.0-incubating-SNAPSHOT/hama-core-0.5.0-incubating-SNAPSHOT-tests.jar
                          
[WARNING] The dependency: [org.apache.hama:hama-core:jar:0.5.0-incubating-SNAPSHOT] can't
be resolved but has been found in the reactor (probably snapshots).
This dependency has been excluded from the Javadoc classpath. You should rerun javadoc after
executing mvn install.
[WARNING] The dependency: [org.apache.hama:hama-core:jar:0.5.0-incubating-SNAPSHOT] can't
be resolved but has been found in the reactor (probably snapshots).
This dependency has been excluded from the Javadoc classpath. You should rerun javadoc after
executing mvn install.
[INFO] ------------------------------------------------------------------------
[INFO] Reactor Summary:
[INFO] 
[INFO] Apache Hama parent POM ............................ FAILURE [4:53.814s]
[INFO] core .............................................. SKIPPED
[INFO] graph ............................................. SKIPPED
[INFO] examples .......................................... SKIPPED
[INFO] yarn .............................................. SKIPPED
[INFO] hama-dist ......................................... SKIPPED
[INFO] ------------------------------------------------------------------------
[INFO] BUILD FAILURE
[INFO] ------------------------------------------------------------------------
[INFO] Total time: 5:02.914s
[INFO] Finished at: Mon May 28 12:05:47 UTC 2012
[INFO] Final Memory: 15M/59M
[INFO] ------------------------------------------------------------------------
[ERROR] Failed to execute goal org.apache.maven.plugins:maven-javadoc-plugin:2.6:aggregate-jar
(default) on project hama-parent: MavenReportException: Error while creating archive:Missing:
[ERROR] ----------
[ERROR] 1) org.apache.hama:hama-core:jar:0.5.0-incubating-SNAPSHOT
[ERROR] 
[ERROR] Try downloading the file manually from the project website.
[ERROR] 
[ERROR] Then, install it using the command:
[ERROR] mvn install:install-file -DgroupId=org.apache.hama -DartifactId=hama-core -Dversion=0.5.0-incubating-SNAPSHOT
-Dpackaging=jar -Dfile=/path/to/file
[ERROR] 
[ERROR] Alternatively, if you host your own repository you can deploy the file there:
[ERROR] mvn deploy:deploy-file -DgroupId=org.apache.hama -DartifactId=hama-core -Dversion=0.5.0-incubating-SNAPSHOT
-Dpackaging=jar -Dfile=/path/to/file -Durl=[url] -DrepositoryId=[id]
[ERROR] 
[ERROR] Path to dependency:
[ERROR] 1) org.apache.hama:hama-graph:jar:0.5.0-incubating-SNAPSHOT
[ERROR] 2) org.apache.hama:hama-core:jar:0.5.0-incubating-SNAPSHOT
[ERROR] 
[ERROR] 2) org.apache.hama:hama-core:test-jar:tests:0.5.0-incubating-SNAPSHOT
[ERROR] 
[ERROR] Try downloading the file manually from the project website.
[ERROR] 
[ERROR] Then, install it using the command:
[ERROR] mvn install:install-file -DgroupId=org.apache.hama -DartifactId=hama-core -Dversion=0.5.0-incubating-SNAPSHOT
-Dclassifier=tests -Dpackaging=test-jar -Dfile=/path/to/file
[ERROR] 
[ERROR] Alternatively, if you host your own repository you can deploy the file there:
[ERROR] mvn deploy:deploy-file -DgroupId=org.apache.hama -DartifactId=hama-core -Dversion=0.5.0-incubating-SNAPSHOT
-Dclassifier=tests -Dpackaging=test-jar -Dfile=/path/to/file -Durl=[url] -DrepositoryId=[id]
[ERROR] 
[ERROR] Path to dependency:
[ERROR] 1) org.apache.hama:hama-graph:jar:0.5.0-incubating-SNAPSHOT
[ERROR] 2) org.apache.hama:hama-core:test-jar:tests:0.5.0-incubating-SNAPSHOT
[ERROR] 
[ERROR] ----------
[ERROR] 2 required artifacts are missing.
[ERROR] 
[ERROR] for artifact:
[ERROR] org.apache.hama:hama-graph:jar:0.5.0-incubating-SNAPSHOT
[ERROR] 
[ERROR] from the specified remote repositories:
[ERROR] Nexus (http://repository.apache.org/snapshots, releases=false, snapshots=true),
[ERROR] central (http://repo1.maven.org/maven2, releases=true, snapshots=false)
[ERROR] -> [Help 1]
[ERROR] 
[ERROR] To see the full stack trace of the errors, re-run Maven with the -e switch.
[ERROR] Re-run Maven using the -X switch to enable full debug logging.
[ERROR] 
[ERROR] For more information about the errors and possible solutions, please read the following
articles:
[ERROR] [Help 1] http://cwiki.apache.org/confluence/display/MAVEN/MojoExecutionException
Build step 'Invoke top-level Maven targets' marked build as failure
Archiving artifacts
Recording test results

Mime
View raw message