hama-dev mailing list archives

Site index · List index
Message view « Date » · « Thread »
Top « Date » · « Thread »
From Apache Jenkins Server <jenk...@builds.apache.org>
Subject Build failed in Jenkins: Hama-Nightly #478
Date Thu, 08 Mar 2012 23:03:54 GMT
See <https://builds.apache.org/job/Hama-Nightly/478/changes>

Changes:

[tjungblut] add changes

[tjungblut] [HAMA-485]: Fill Counters with useful information

[tjungblut] Testcase fix (contributed by Suraj Menon)

[edwardyoon] Add MinIntCombiner to SSSP example

------------------------------------------
Started by timer
Building remotely on ubuntu1 in workspace <https://builds.apache.org/job/Hama-Nightly/ws/>
Reverting <https://builds.apache.org/job/Hama-Nightly/ws/trunk>
Updating http://svn.apache.org/repos/asf/incubator/hama/trunk
U         graph/src/main/java/org/apache/hama/graph/GraphJobRunner.java
U         graph/src/main/java/org/apache/hama/graph/GraphJob.java
U         graph/src/main/java/org/apache/hama/graph/VertexInterface.java
U         CHANGES.txt
U         core/src/test/java/org/apache/hama/bsp/message/TestAvroMessageManager.java
U         core/src/test/java/org/apache/hama/bsp/message/TestHadoopMessageManager.java
U         core/src/test/java/org/apache/hama/bsp/TestBSPTaskFaults.java
U         core/src/test/java/org/apache/hama/bsp/TestCheckpoint.java
U         core/src/main/java/org/apache/hama/bsp/message/MessageManager.java
U         core/src/main/java/org/apache/hama/bsp/message/AvroMessageManagerImpl.java
U         core/src/main/java/org/apache/hama/bsp/message/HadoopMessageManagerImpl.java
U         core/src/main/java/org/apache/hama/bsp/Combiner.java
U         core/src/main/java/org/apache/hama/bsp/LocalBSPRunner.java
U         core/src/main/java/org/apache/hama/bsp/BSPPeerImpl.java
U         core/src/main/java/org/apache/hama/bsp/BSPPeer.java
U         examples/src/main/java/org/apache/hama/examples/CombineExample.java
U         examples/src/main/java/org/apache/hama/examples/SSSP.java
At revision 1298645
[Hama-Nightly] $ /bin/bash -xe /tmp/hudson631702122401480586.sh
+ echo /home/hudson/tools/java/latest1.6/bin:/usr/local/bin:/usr/bin:/bin:/usr/bin/X11:/usr/games:/usr/ucb:/usr/sfw/bin:/usr/ccs/bin:/usr/ucb:/usr/sfw/bin:/usr/ccs/bin:/usr/ucb:/usr/sfw/bin:/usr/ccs/bin:/usr/ucb:/usr/sfw/bin:/usr/ccs/bin
/home/hudson/tools/java/latest1.6/bin:/usr/local/bin:/usr/bin:/bin:/usr/bin/X11:/usr/games:/usr/ucb:/usr/sfw/bin:/usr/ccs/bin:/usr/ucb:/usr/sfw/bin:/usr/ccs/bin:/usr/ucb:/usr/sfw/bin:/usr/ccs/bin:/usr/ucb:/usr/sfw/bin:/usr/ccs/bin
+ whoami
jenkins
+ ulimit -a
core file size          (blocks, -c) 0
data seg size           (kbytes, -d) unlimited
scheduling priority             (-e) 20
file size               (blocks, -f) unlimited
pending signals                 (-i) 16382
max locked memory       (kbytes, -l) 64
max memory size         (kbytes, -m) unlimited
open files                      (-n) 40000
pipe size            (512 bytes, -p) 8
POSIX message queues     (bytes, -q) 819200
real-time priority              (-r) 0
stack size              (kbytes, -s) 8192
cpu time               (seconds, -t) unlimited
max user processes              (-u) unlimited
virtual memory          (kbytes, -v) unlimited
file locks                      (-x) unlimited
[trunk] $ /home/hudson/tools/maven/latest3/bin/mvn -Dmaven.repo.local=<https://builds.apache.org/job/Hama-Nightly/ws/.repository>
clean install package
[INFO] Scanning for projects...
[WARNING] 
[WARNING] Some problems were encountered while building the effective model for org.apache.hama:hama-core:jar:0.5.0-incubating-SNAPSHOT
[WARNING] 'build.plugins.plugin.version' for org.codehaus.mojo:build-helper-maven-plugin is
missing. @ line 214, column 15
[WARNING] 
[WARNING] It is highly recommended to fix these problems because they threaten the stability
of your build.
[WARNING] 
[WARNING] For this reason, future Maven versions might no longer support building such malformed
projects.
[WARNING] 
[INFO] ------------------------------------------------------------------------
[INFO] Reactor Build Order:
[INFO] 
[INFO] Apache Hama parent POM
[INFO] core
[INFO] graph
[INFO] examples
[INFO] yarn
[INFO] dist
[INFO]                                                                         
[INFO] ------------------------------------------------------------------------
[INFO] Building Apache Hama parent POM 0.5.0-incubating-SNAPSHOT
[INFO] ------------------------------------------------------------------------
[INFO] 
[INFO] --- maven-clean-plugin:2.4.1:clean (default-clean) @ hama-parent ---
[INFO] Deleting <https://builds.apache.org/job/Hama-Nightly/ws/trunk/target>
[INFO] 
[INFO] --- maven-remote-resources-plugin:1.1:process (default) @ hama-parent ---
[INFO] Setting property: classpath.resource.loader.class => 'org.codehaus.plexus.velocity.ContextClassLoaderResourceLoader'.
[INFO] Setting property: velocimacro.messages.on => 'false'.
[INFO] Setting property: resource.loader => 'classpath'.
[INFO] Setting property: resource.manager.logwhenfound => 'false'.
[INFO] 
[INFO] --- apache-rat-plugin:0.8:check (default) @ hama-parent ---
[INFO] Exclude: **/*.asc
[INFO] Exclude: **/logs/**
[INFO] Exclude: CHANGES.txt
[INFO] Exclude: conf/groomservers
[INFO] Exclude: src/site/resources/files/hama-eclipse-formatter.xml
[INFO] Exclude: **/src/test/resources/*.properties
[INFO] Exclude: **dependency-reduced-pom.xml
[INFO] 
[INFO] --- maven-install-plugin:2.3:install (default-install) @ hama-parent ---
[INFO] Installing <https://builds.apache.org/job/Hama-Nightly/ws/trunk/pom.xml> to <https://builds.apache.org/job/Hama-Nightly/ws/.repository/org/apache/hama/hama-parent/0.5.0-incubating-SNAPSHOT/hama-parent-0.5.0-incubating-SNAPSHOT.pom>
[INFO] 
[INFO] --- maven-remote-resources-plugin:1.1:process (default) @ hama-parent ---
[INFO] 
[INFO] --- apache-rat-plugin:0.8:check (default) @ hama-parent ---
[INFO] Exclude: **/*.asc
[INFO] Exclude: **/logs/**
[INFO] Exclude: CHANGES.txt
[INFO] Exclude: conf/groomservers
[INFO] Exclude: src/site/resources/files/hama-eclipse-formatter.xml
[INFO] Exclude: **/src/test/resources/*.properties
[INFO] Exclude: **dependency-reduced-pom.xml
[INFO]                                                                         
[INFO] ------------------------------------------------------------------------
[INFO] Building core 0.5.0-incubating-SNAPSHOT
[INFO] ------------------------------------------------------------------------
[INFO] 
[INFO] --- maven-clean-plugin:2.4.1:clean (default-clean) @ hama-core ---
[INFO] Deleting <https://builds.apache.org/job/Hama-Nightly/ws/trunk/core/target>
[INFO] 
[INFO] --- maven-antrun-plugin:1.6:run (save-version) @ hama-core ---
[INFO] Executing tasks

main:
    [mkdir] Created dir: <https://builds.apache.org/job/Hama-Nightly/ws/trunk/core/target/generated-sources/java>
[INFO] Executed tasks
[INFO] 
[INFO] --- build-helper-maven-plugin:1.7:add-source (add-source) @ hama-core ---
[INFO] Source directory: <https://builds.apache.org/job/Hama-Nightly/ws/trunk/core/target/generated-sources/annotations>
added.
[INFO] 
[INFO] --- maven-remote-resources-plugin:1.1:process (default) @ hama-core ---
[INFO] 
[INFO] --- maven-resources-plugin:2.4:resources (default-resources) @ hama-core ---
[INFO] Using 'UTF-8' encoding to copy filtered resources.
[INFO] Copying 0 resource
[INFO] Copying 3 resources
[INFO] 
[INFO] --- maven-compiler-plugin:2.3.2:compile (default-compile) @ hama-core ---
[INFO] Compiling 156 source files to <https://builds.apache.org/job/Hama-Nightly/ws/trunk/core/target/classes>
[INFO] -------------------------------------------------------------
[ERROR] COMPILATION ERROR : 
[INFO] -------------------------------------------------------------
[ERROR] <https://builds.apache.org/job/Hama-Nightly/ws/trunk/core/src/main/java/org/apache/hama/bsp/BSPPeerImpl.java>:[227,15]
cannot find symbol
symbol  : class TrackedRecordReader
location: class org.apache.hama.bsp.BSPPeerImpl<K1,V1,K2,V2,M>
[INFO] 1 error
[INFO] -------------------------------------------------------------
[INFO] ------------------------------------------------------------------------
[INFO] Reactor Summary:
[INFO] 
[INFO] Apache Hama parent POM ............................ SUCCESS [5.023s]
[INFO] core .............................................. FAILURE [6.197s]
[INFO] graph ............................................. SKIPPED
[INFO] examples .......................................... SKIPPED
[INFO] yarn .............................................. SKIPPED
[INFO] dist .............................................. SKIPPED
[INFO] ------------------------------------------------------------------------
[INFO] BUILD FAILURE
[INFO] ------------------------------------------------------------------------
[INFO] Total time: 11.774s
[INFO] Finished at: Thu Mar 08 23:02:50 UTC 2012
[INFO] Final Memory: 19M/164M
[INFO] ------------------------------------------------------------------------
[ERROR] Failed to execute goal org.apache.maven.plugins:maven-compiler-plugin:2.3.2:compile
(default-compile) on project hama-core: Compilation failure
[ERROR] <https://builds.apache.org/job/Hama-Nightly/ws/trunk/core/src/main/java/org/apache/hama/bsp/BSPPeerImpl.java>:[227,15]
cannot find symbol
[ERROR] symbol  : class TrackedRecordReader
[ERROR] location: class org.apache.hama.bsp.BSPPeerImpl<K1,V1,K2,V2,M>
[ERROR] -> [Help 1]
[ERROR] 
[ERROR] To see the full stack trace of the errors, re-run Maven with the -e switch.
[ERROR] Re-run Maven using the -X switch to enable full debug logging.
[ERROR] 
[ERROR] For more information about the errors and possible solutions, please read the following
articles:
[ERROR] [Help 1] http://cwiki.apache.org/confluence/display/MAVEN/MojoFailureException
[ERROR] 
[ERROR] After correcting the problems, you can resume the build with the command
[ERROR]   mvn <goals> -rf :hama-core
Build step 'Invoke top-level Maven targets' marked build as failure
Archiving artifacts
Recording test results
Updating HAMA-485


Mime
View raw message