hama-dev mailing list archives

Site index · List index
Message view « Date » · « Thread »
Top « Date » · « Thread »
From Apache Jenkins Server <jenk...@builds.apache.org>
Subject Build failed in Jenkins: Hama-Patch #357
Date Tue, 20 Sep 2011 08:34:51 GMT
See <https://builds.apache.org/job/Hama-Patch/357/>

------------------------------------------
[...truncated 1154 lines...]
11/09/20 04:33:53 INFO ipc.Server: IPC Server handler 4 on 46781: exiting

11/09/20 04:33:53 INFO ipc.Server: IPC Server handler 6 on 46781: exiting

11/09/20 04:33:53 INFO ipc.Server: IPC Server handler 8 on 46781: exiting

11/09/20 04:33:53 INFO ipc.Server: IPC Server handler 9 on 46781: exiting

11/09/20 04:33:53 INFO ipc.Server: Stopping IPC Server Responder

11/09/20 04:33:53 INFO ipc.Server: IPC Server handler 2 on 46781: exiting

11/09/20 04:33:53 INFO ipc.Server: IPC Server handler 5 on 46781: exiting

11/09/20 04:33:53 INFO ipc.Server: IPC Server handler 7 on 46781: exiting

11/09/20 04:33:53 INFO ipc.Server: Stopping IPC Server listener on 46781

11/09/20 04:33:53 INFO ipc.Server: Stopping IPC Server listener on 46780

11/09/20 04:33:53 INFO metrics.RpcMetrics: Initializing RPC Metrics with hostName=0, port=46786

11/09/20 04:33:53 INFO ipc.Server: IPC Server handler 8 on 46786: starting

11/09/20 04:33:53 INFO ipc.Server: IPC Server handler 6 on 46786: starting

11/09/20 04:33:53 INFO ipc.Server: IPC Server handler 4 on 46786: starting

11/09/20 04:33:53 INFO ipc.Server: IPC Server handler 2 on 46786: starting

11/09/20 04:33:53 INFO ipc.Server: IPC Server handler 1 on 46786: starting

11/09/20 04:33:53 INFO ipc.Server: IPC Server handler 0 on 46786: starting

11/09/20 04:33:53 INFO ipc.Server: IPC Server listener on 46786: starting

11/09/20 04:33:53 INFO metrics.RpcMetrics: Initializing RPC Metrics with hostName=0, port=46787

11/09/20 04:33:53 INFO ipc.Server: IPC Server Responder: starting

11/09/20 04:33:53 INFO ipc.Server: IPC Server handler 3 on 46786: starting

11/09/20 04:33:53 INFO ipc.Server: IPC Server handler 5 on 46786: starting

11/09/20 04:33:53 INFO ipc.Server: IPC Server handler 7 on 46786: starting

11/09/20 04:33:53 INFO ipc.Server: IPC Server handler 9 on 46786: starting

11/09/20 04:33:53 INFO ipc.Server: IPC Server listener on 46787: starting

11/09/20 04:33:53 INFO ipc.Server: IPC Server handler 9 on 46787: starting

11/09/20 04:33:53 INFO ipc.Server: IPC Server handler 8 on 46787: starting

11/09/20 04:33:53 INFO ipc.Server: IPC Server handler 7 on 46787: starting

11/09/20 04:33:53 INFO ipc.Server: IPC Server handler 6 on 46787: starting

11/09/20 04:33:53 INFO ipc.Server: IPC Server handler 5 on 46787: starting

11/09/20 04:33:53 INFO ipc.Server: IPC Server handler 4 on 46787: starting

11/09/20 04:33:53 INFO ipc.Server: IPC Server handler 3 on 46787: starting

11/09/20 04:33:53 INFO ipc.Server: IPC Server handler 2 on 46787: starting

11/09/20 04:33:53 INFO ipc.Server: IPC Server handler 1 on 46787: starting

11/09/20 04:33:53 INFO ipc.Server: IPC Server handler 0 on 46787: starting

11/09/20 04:33:53 INFO ipc.Server: IPC Server Responder: starting

11/09/20 04:33:54 INFO ipc.Server: Stopping server on 46786

11/09/20 04:33:54 INFO ipc.Server: IPC Server handler 0 on 46786: exiting

11/09/20 04:33:54 INFO ipc.Server: IPC Server handler 5 on 46786: exiting

11/09/20 04:33:54 INFO ipc.Server: IPC Server handler 7 on 46786: exiting

11/09/20 04:33:54 INFO ipc.Server: Stopping IPC Server listener on 46786

11/09/20 04:33:54 INFO ipc.Server: Stopping IPC Server Responder

11/09/20 04:33:54 INFO ipc.Server: IPC Server handler 8 on 46786: exiting

11/09/20 04:33:54 INFO ipc.Server: IPC Server handler 6 on 46786: exiting

11/09/20 04:33:54 INFO ipc.Server: IPC Server handler 4 on 46786: exiting

11/09/20 04:33:54 INFO ipc.Server: IPC Server handler 3 on 46786: exiting

11/09/20 04:33:54 INFO ipc.Server: Stopping server on 46787

11/09/20 04:33:54 INFO ipc.Server: IPC Server handler 2 on 46787: exiting

11/09/20 04:33:54 INFO ipc.Server: IPC Server handler 4 on 46787: exiting

11/09/20 04:33:54 INFO ipc.Server: IPC Server handler 6 on 46787: exiting

11/09/20 04:33:54 INFO ipc.Server: IPC Server handler 8 on 46787: exiting

11/09/20 04:33:54 INFO ipc.Server: Stopping IPC Server listener on 46787

11/09/20 04:33:54 INFO ipc.Server: IPC Server handler 9 on 46786: exiting

11/09/20 04:33:54 INFO ipc.Server: IPC Server handler 0 on 46787: exiting

11/09/20 04:33:54 INFO ipc.Server: IPC Server handler 1 on 46786: exiting

11/09/20 04:33:54 INFO ipc.Server: IPC Server handler 1 on 46787: exiting

11/09/20 04:33:54 INFO ipc.Server: IPC Server handler 3 on 46787: exiting

11/09/20 04:33:54 INFO ipc.Server: IPC Server handler 5 on 46787: exiting

11/09/20 04:33:54 INFO ipc.Server: IPC Server handler 7 on 46787: exiting

11/09/20 04:33:54 INFO ipc.Server: IPC Server handler 9 on 46787: exiting

11/09/20 04:33:54 INFO ipc.Server: IPC Server handler 2 on 46786: exiting

11/09/20 04:33:54 INFO ipc.Server: Stopping IPC Server Responder

11/09/20 04:33:55 INFO ipc.Client: Retrying connect to server: /127.0.0.1:10. Already tried
0 time(s).

11/09/20 04:33:56 INFO ipc.Client: Retrying connect to server: /127.0.0.1:10. Already tried
1 time(s).

11/09/20 04:33:57 INFO ipc.Client: Retrying connect to server: /127.0.0.1:10. Already tried
2 time(s).

11/09/20 04:33:58 INFO ipc.Client: Retrying connect to server: /127.0.0.1:10. Already tried
3 time(s).

11/09/20 04:33:59 INFO ipc.Client: Retrying connect to server: /127.0.0.1:10. Already tried
4 time(s).

11/09/20 04:34:00 INFO ipc.Client: Retrying connect to server: /127.0.0.1:10. Already tried
5 time(s).

11/09/20 04:34:01 INFO ipc.Client: Retrying connect to server: /127.0.0.1:10. Already tried
6 time(s).

11/09/20 04:34:02 INFO ipc.Client: Retrying connect to server: /127.0.0.1:10. Already tried
7 time(s).

11/09/20 04:34:03 INFO ipc.Client: Retrying connect to server: /127.0.0.1:10. Already tried
8 time(s).

11/09/20 04:34:04 INFO ipc.Client: Retrying connect to server: /127.0.0.1:10. Already tried
9 time(s).

Tests run: 3, Failures: 0, Errors: 0, Skipped: 0, Time elapsed: 0.05 sec
Running org.apache.hama.ipc.TestRPC
11/09/20 04:34:19 INFO metrics.RpcMetrics: Initializing RPC Metrics with hostName=TestRPC$TestImpl,
port=1234

11/09/20 04:34:20 INFO ipc.Server: IPC Server Responder: starting

11/09/20 04:34:20 INFO ipc.Server: IPC Server listener on 1234: starting

11/09/20 04:34:20 INFO ipc.Server: IPC Server handler 0 on 1234: starting

11/09/20 04:34:20 INFO ipc.Server: IPC Server handler 0 on 1234, call error() from 140.211.11.106:46806:
error: java.io.IOException: bobo
java.io.IOException: bobo
	at org.apache.hama.ipc.TestRPC$TestImpl.error(TestRPC.java:102)
	at sun.reflect.NativeMethodAccessorImpl.invoke0(Native Method)
	at sun.reflect.NativeMethodAccessorImpl.invoke(NativeMethodAccessorImpl.java:39)
	at sun.reflect.DelegatingMethodAccessorImpl.invoke(DelegatingMethodAccessorImpl.java:25)
	at java.lang.reflect.Method.invoke(Method.java:597)
	at org.apache.hadoop.ipc.RPC$Server.call(RPC.java:508)
	at org.apache.hadoop.ipc.Server$Handler$1.run(Server.java:959)
	at org.apache.hadoop.ipc.Server$Handler$1.run(Server.java:955)
	at java.security.AccessController.doPrivileged(Native Method)
	at javax.security.auth.Subject.doAs(Subject.java:396)
	at org.apache.hadoop.ipc.Server$Handler.run(Server.java:953)

11/09/20 04:34:21 INFO ipc.Server: Stopping server on 1234

11/09/20 04:34:21 INFO ipc.Server: IPC Server handler 0 on 1234: exiting

11/09/20 04:34:21 INFO ipc.Server: Stopping IPC Server listener on 1234

11/09/20 04:34:21 INFO ipc.Server: Stopping IPC Server Responder

Tests run: 1, Failures: 0, Errors: 0, Skipped: 0, Time elapsed: 0.015 sec
Running org.apache.hama.zookeeper.TestZKTools
Tests run: 1, Failures: 0, Errors: 0, Skipped: 0, Time elapsed: 0.018 sec

Results :

Tests in error: 

Tests run: 23, Failures: 0, Errors: 1, Skipped: 0

[INFO] ------------------------------------------------------------------------
[INFO] Reactor Summary:
[INFO] 
[INFO] Apache Hama parent POM ............................ SUCCESS [11.733s]
[INFO] Apache Hama Core .................................. FAILURE [2:55.550s]
[INFO] Apache Hama Graph Package ......................... SKIPPED
[INFO] Apache Hama Examples .............................. SKIPPED
[INFO] ------------------------------------------------------------------------
[INFO] BUILD FAILURE
[INFO] ------------------------------------------------------------------------
[INFO] Total time: 3:09.099s
[INFO] Finished at: Tue Sep 20 04:34:24 EDT 2011
[INFO] Final Memory: 19M/158M
[INFO] ------------------------------------------------------------------------
[ERROR] Failed to execute goal org.apache.maven.plugins:maven-surefire-plugin:2.6:test (default-test)
on project hama-core: There are test failures.
[ERROR] 
[ERROR] Please refer to /zonestorage/hudson<https://builds.apache.org/job/Hama-Patch/ws/trunk/core/target/surefire-reports>
for the individual test results.
[ERROR] -> [Help 1]
[ERROR] 
[ERROR] To see the full stack trace of the errors, re-run Maven with the -e switch.
[ERROR] Re-run Maven using the -X switch to enable full debug logging.
[ERROR] 
[ERROR] For more information about the errors and possible solutions, please read the following
articles:
[ERROR] [Help 1] http://cwiki.apache.org/confluence/display/MAVEN/MojoFailureException
[ERROR] 
[ERROR] After correcting the problems, you can resume the build with the command
[ERROR]   mvn <goals> -rf :hama-core


======================================================================
======================================================================
    Adding comment to Jira.
======================================================================
======================================================================


-1 overall.  Here are the results of testing the latest attachment 
http://issues.apache.org/jira/secure/attachment/12495198/HAMA-437_v2.patch
against trunk revision 1171537.

    @author +1.  The patch does not contain any @author tags.

    tests included +1.  The patch appears to include 3 new or modified tests.

    core tests -1.  The patch failed core unit tests.

Changes : http://builds.apache.org/hudson/job/Hama-Patch/357/changes/
Console output: http://builds.apache.org/hudson/job/Hama-Patch/357/console

This message is automatically generated.


======================================================================
======================================================================
    Finished build.
======================================================================
======================================================================


Build step 'Execute shell' marked build as failure
[FINDBUGS] Skipping publisher since build result is FAILURE
Archiving artifacts
Description set: HAMA-437


Mime
View raw message