hama-dev mailing list archives

Site index · List index
Message view « Date » · « Thread »
Top « Date » · « Thread »
From Apache Hudson Server <hud...@hudson.zones.apache.org>
Subject Build failed in Hudson: Hama-Patch #202
Date Mon, 26 Oct 2009 06:53:09 GMT
See <http://hudson.zones.apache.org/hudson/job/Hama-Patch/202/>

------------------------------------------
[...truncated 26 lines...]
Reverted 'src/java/org/apache/hama/Constants.java'
Reverted 'src/examples/org/apache/hama/examples/CosineSimilarityMatrix.java'
Error validating server certificate for 'https://svn.apache.org:443':
 - The certificate is not issued by a trusted authority. Use the
   fingerprint to validate the certificate manually!
Certificate information:
 - Hostname: svn.apache.org
 - Valid: from Nov 13 18:56:12 2008 GMT until Jan 26 14:18:55 2012 GMT
 - Issuer: 07969287, http://certificates.godaddy.com/repository, GoDaddy.com, Inc., Scottsdale,
Arizona, US
 - Fingerprint: cc:54:a4:a9:ec:3a:9b:1c:23:ac:2d:57:c6:96:9f:5f:4a:1d:2d:86
(R)eject, accept (t)emporarily or accept (p)ermanently? svn: PROPFIND request failed on '/repos/asf/incubator/hama/trunk'
svn: PROPFIND of '/repos/asf/incubator/hama/trunk': Server certificate verification failed:
issuer is not trusted (https://svn.apache.org)
HAMA-215 patch is being downloaded at Mon Oct 26 06:51:08 UTC 2009 from
http://issues.apache.org/jira/secure/attachment/12423168/HAMA-215_v01.patch


======================================================================
======================================================================
    Pre-building trunk to determine trunk number
    of release audit, javac, and Findbugs warnings.
======================================================================
======================================================================




======================================================================
======================================================================
    Checking there are no @author tags in the patch.
======================================================================
======================================================================


There appear to be 0 @author tags in the patch.


======================================================================
======================================================================
    Checking there are new or changed tests in the patch.
======================================================================
======================================================================


There appear to be 4 test files referenced in the patch.


======================================================================
======================================================================
    Applying patch.
======================================================================
======================================================================


patching file build.xml
patching file src/examples/org/apache/hama/examples/CosineSimilarityMatrix.java
patching file src/java/org/apache/hama/Constants.java
patching file src/java/org/apache/hama/HamaAdminImpl.java
patching file src/java/org/apache/hama/io/VectorUpdate.java
patching file src/java/org/apache/hama/mapred/VectorInputFormat.java
patching file src/java/org/apache/hama/matrix/AbstractMatrix.java
patching file src/java/org/apache/hama/matrix/AbstractVector.java
patching file src/java/org/apache/hama/matrix/algebra/JacobiEigenValue.java
patching file src/java/org/apache/hama/matrix/DenseMatrix.java
patching file src/java/org/apache/hama/matrix/DenseVector.java
patching file src/java/org/apache/hama/matrix/SparseMatrix.java
patching file src/java/org/apache/hama/shell/execution/AlgebraOperation.java
patching file src/java/org/apache/hama/shell/execution/AlgebraOperator.java
patching file src/java/org/apache/hama/shell/execution/AlgebraOpException.java
patching file src/java/org/apache/hama/shell/execution/EvalExpression.java
patching file src/java/org/apache/hama/shell/execution/HamaExpression.java
patching file src/java/org/apache/hama/shell/execution/HamaOperation.java
patching file src/java/org/apache/hama/shell/execution/LoadOperation.java
patching file src/java/org/apache/hama/shell/execution/package.html
patching file src/java/org/apache/hama/shell/execution/RandMatrixOperation.java
patching file src/java/org/apache/hama/shell/execution/SaveExpression.java
patching file src/java/org/apache/hama/shell/HamaShell.java
patching file src/java/org/apache/hama/shell/HamaShellEnv.java
patching file src/java/org/apache/hama/shell/HamaShellParser.java
patching file src/java/org/apache/hama/shell/package.html
patching file src/java/org/apache/hama/shell/parser/expression/grammar
patching file src/java/org/apache/hama/shell/parser/expression/HamaExpressionParser.jjt
patching file src/java/org/apache/hama/shell/parser/expression/package.html
patching file src/java/org/apache/hama/shell/parser/script/HamaScriptParser.jj
patching file src/java/org/apache/hama/shell/parser/script/package.html
patching file src/test/org/apache/hama/examples/TestCosineSimilarityMatrix.java


======================================================================
======================================================================
    Determining number of patched javadoc warnings.
======================================================================
======================================================================


Buildfile: build.xml

clean:
   [delete] Deleting directory /zonestorage/hudson/home/hudson/hudson/jobs/Hama-Patch/workspace/trunk/build

javadoc:
    [mkdir] Created dir: /zonestorage/hudson/home/hudson/hudson/jobs/Hama-Patch/workspace/trunk/build/docs/site/api
  [javadoc] Generating Javadoc
  [javadoc] Javadoc execution
  [javadoc] Loading source files for package org.apache.hama...
  [javadoc] Loading source files for package org.apache.hama.bsp...
  [javadoc] Loading source files for package org.apache.hama.graph...
  [javadoc] Loading source files for package org.apache.hama.io...
  [javadoc] Loading source files for package org.apache.hama.mapred...
  [javadoc] Loading source files for package org.apache.hama.mapreduce...
  [javadoc] Loading source files for package org.apache.hama.matrix...
  [javadoc] Loading source files for package org.apache.hama.matrix.algebra...
  [javadoc] Loading source files for package org.apache.hama.util...
  [javadoc] Constructing Javadoc information...
  [javadoc] Standard Doclet version 1.6.0_06
  [javadoc] Building tree for all the packages and classes...
  [javadoc] Building index for all the packages and classes...
  [javadoc] Building index for all classes...

BUILD SUCCESSFUL
Total time: 8 seconds


There appear to be 0 javadoc warnings generated by the patched build.


======================================================================
======================================================================
    Determining number of patched javac warnings.
======================================================================
======================================================================




There appear to be  javac compiler warnings before the patch and  javac compiler warnings
after applying the patch.


======================================================================
======================================================================
    Determining number of patched release audit warnings.
======================================================================
======================================================================




There appear to be 0 release audit warnings before the patch and 0 release audit warnings
after applying the patch.


======================================================================
======================================================================
    Determining number of patched checkstyle warnings.
======================================================================
======================================================================


THIS IS NOT IMPLEMENTED YET


Buildfile: build.xml

BUILD FAILED
Target "checkstyle" does not exist in the project "hama". 

Total time: 0 seconds


======================================================================
======================================================================
    Determining number of patched Findbugs warnings.
======================================================================
======================================================================


Buildfile: build.xml

init:

compile:

BUILD FAILED
/zonestorage/hudson/home/hudson/hudson/jobs/Hama-Patch/workspace/trunk/build.xml:111: srcdir
"/zonestorage/hudson/home/hudson/hudson/jobs/Hama-Patch/workspace/trunk/${src.gen.dir}" does
not exist!

Total time: 0 seconds


======================================================================
======================================================================
    Running Hama tests.
======================================================================
======================================================================


/usr/bin/kill -9 26926
kill: 26926: no such process
Buildfile: build.xml

init:

compile:

BUILD FAILED
/zonestorage/hudson/home/hudson/hudson/jobs/Hama-Patch/workspace/trunk/build.xml:111: srcdir
"/zonestorage/hudson/home/hudson/hudson/jobs/Hama-Patch/workspace/trunk/${src.gen.dir}" does
not exist!

Total time: 0 seconds


======================================================================
======================================================================
    Adding comment to Jira.
======================================================================
======================================================================


-1 overall.  Here are the results of testing the latest attachment 
http://issues.apache.org/jira/secure/attachment/12423168/HAMA-215_v01.patch
against trunk revision 828920.

    @author +1.  The patch does not contain any @author tags.

    tests included +1.  The patch appears to include 4 new or modified tests.

    javadoc +1.  The javadoc tool did not generate any warning messages.

    javac +1.  The applied patch does not generate any new javac compiler warnings.

    release audit +1.  The applied patch does not generate any new release audit warnings.

    findbugs -1.  The patch appears to cause Findbugs to fail.

    core tests -1.  The patch failed core unit tests.

Test results: http://hudson.zones.apache.org/hudson/job/Hama-Patch/202/testReport/
Checkstyle results: http://hudson.zones.apache.org/hudson/job/Hama-Patch/202/artifact/trunk/build/test/checkstyle-errors.html
Console output: http://hudson.zones.apache.org/hudson/job/Hama-Patch/202/console

This message is automatically generated.


======================================================================
======================================================================
    Finished build.
======================================================================
======================================================================


Archiving artifacts
Recording test results
Description found: HAMA-215


Mime
View raw message