hadoop-yarn-issues mailing list archives

Site index · List index
Message view « Date » · « Thread »
Top « Date » · « Thread »
From "Aihua Xu (JIRA)" <j...@apache.org>
Subject [jira] [Updated] (YARN-9211) The yarn resourcemanager project keeps failing with " There was a timeout or other error in the fork" error
Date Fri, 18 Jan 2019 18:01:00 GMT

     [ https://issues.apache.org/jira/browse/YARN-9211?page=com.atlassian.jira.plugin.system.issuetabpanels:all-tabpanel
]

Aihua Xu updated YARN-9211:
---------------------------
    Description: 
Recently notice that the build keeps failing in resourcemanager project with " There was a
timeout or other error in the fork". 

Here is the part of the log, but I don't see any UT failures. 

{noformat}
[WARNING] Tests run: 2445, Failures: 0, Errors: 0, Skipped: 7
[INFO] 
[INFO] ------------------------------------------------------------------------
[INFO] BUILD FAILURE
[INFO] ------------------------------------------------------------------------
[INFO] Total time: 01:32 h
[INFO] Finished at: 2019-01-18T11:30:20+00:00
[INFO] Final Memory: 23M/773M
[INFO] ------------------------------------------------------------------------
[WARNING] The requested profile "parallel-tests" could not be activated because it does not
exist.
[WARNING] The requested profile "native" could not be activated because it does not exist.
[WARNING] The requested profile "yarn-ui" could not be activated because it does not exist.
[ERROR] Failed to execute goal org.apache.maven.plugins:maven-surefire-plugin:3.0.0-M1:test
(default-test) on project hadoop-yarn-server-resourcemanager: There was a timeout or other
error in the fork -> [Help 1]
{noformat}

Here is a job https://builds.apache.org/job/PreCommit-YARN-Build/23107/console

  was:
Recently notice that the build keeps failing in resourcemanager project with " There was a
timeout or other error in the fork". 

Here is the part of the log, but I don't see any UT failures. 

{noformat}
[WARNING] Tests run: 2445, Failures: 0, Errors: 0, Skipped: 7
[INFO] 
[INFO] ------------------------------------------------------------------------
[INFO] BUILD FAILURE
[INFO] ------------------------------------------------------------------------
[INFO] Total time: 01:32 h
[INFO] Finished at: 2019-01-18T11:30:20+00:00
[INFO] Final Memory: 23M/773M
[INFO] ------------------------------------------------------------------------
[WARNING] The requested profile "parallel-tests" could not be activated because it does not
exist.
[WARNING] The requested profile "native" could not be activated because it does not exist.
[WARNING] The requested profile "yarn-ui" could not be activated because it does not exist.
[ERROR] Failed to execute goal org.apache.maven.plugins:maven-surefire-plugin:3.0.0-M1:test
(default-test) on project hadoop-yarn-server-resourcemanager: There was a timeout or other
error in the fork -> [Help 1]
{noformat}


> The yarn resourcemanager project keeps failing with " There was a timeout or other error
in the fork" error
> -----------------------------------------------------------------------------------------------------------
>
>                 Key: YARN-9211
>                 URL: https://issues.apache.org/jira/browse/YARN-9211
>             Project: Hadoop YARN
>          Issue Type: Test
>          Components: test
>    Affects Versions: 3.1.2
>            Reporter: Aihua Xu
>            Priority: Major
>
> Recently notice that the build keeps failing in resourcemanager project with " There
was a timeout or other error in the fork". 
> Here is the part of the log, but I don't see any UT failures. 
> {noformat}
> [WARNING] Tests run: 2445, Failures: 0, Errors: 0, Skipped: 7
> [INFO] 
> [INFO] ------------------------------------------------------------------------
> [INFO] BUILD FAILURE
> [INFO] ------------------------------------------------------------------------
> [INFO] Total time: 01:32 h
> [INFO] Finished at: 2019-01-18T11:30:20+00:00
> [INFO] Final Memory: 23M/773M
> [INFO] ------------------------------------------------------------------------
> [WARNING] The requested profile "parallel-tests" could not be activated because it does
not exist.
> [WARNING] The requested profile "native" could not be activated because it does not exist.
> [WARNING] The requested profile "yarn-ui" could not be activated because it does not
exist.
> [ERROR] Failed to execute goal org.apache.maven.plugins:maven-surefire-plugin:3.0.0-M1:test
(default-test) on project hadoop-yarn-server-resourcemanager: There was a timeout or other
error in the fork -> [Help 1]
> {noformat}
> Here is a job https://builds.apache.org/job/PreCommit-YARN-Build/23107/console



--
This message was sent by Atlassian JIRA
(v7.6.3#76005)

---------------------------------------------------------------------
To unsubscribe, e-mail: yarn-issues-unsubscribe@hadoop.apache.org
For additional commands, e-mail: yarn-issues-help@hadoop.apache.org


Mime
View raw message